discuss-gnustep
[Top][All Lists]
Advanced

[Date Prev][Date Next][Thread Prev][Thread Next][Date Index][Thread Index]

Re: [ANN] HighlighterKit 0.1.2 and Gemas 0.3 - Gemas


From: Csanyi Pal
Subject: Re: [ANN] HighlighterKit 0.1.2 and Gemas 0.3 - Gemas
Date: Sun, 19 Feb 2012 14:08:50 +0100
User-agent: Gnus/5.13 (Gnus v5.13) Emacs/23.3 (gnu/linux)

Csanyi Pal <address@hidden> writes:

> Sašo Kiselkov <address@hidden> writes:
>
>> On 02/19/2012 01:40 PM, Csanyi Pal wrote:
>>> Csanyi Pal <address@hidden> writes:
>>> sudo -E checkinstall make install
>>> 
>>
>> Can you first try a vanilla "make install" without checkinstall? My
>> guess is that something goes wrong in the chroot magic which
>> checkinstall uses. Don't worry about files being dumped around your
>> system directories, you can clean everything up with a simple "make
>> uninstall" right after that.
>
> Without checkinstall I can install it.

Now the Gemas building part:

make messages=yes

<output>
This is gnustep-make 2.6.1. Type 'make print-gnustep-make-help' for
help. 
Making all for app Gemas...
gcc-4.6  -rdynamic       -shared-libgcc -fexceptions -fgnu-runtime -o
Gemas.app/./Gemas \ 
        ./obj/Gemas.obj/GemasController.m.o
        ./obj/Gemas.obj/GemasEditorView.m.o
        ./obj/Gemas.obj/GemasDocument.m.o ./obj/Gemas.obj/Gemas_main.m.o
        -L./HighlighterKit/HighlighterKit.framework
        -L/home/csanyipal/GNUstep/Library/Libraries -L/usr/local/lib
        -L/usr/lib   -lHighlighterKit          -lpthread -lobjc   -lm 
./obj/Gemas.obj/GemasController.m.o: In function `-[GemasController
openPreferences:]': 
/home/csanyipal/Programozas/Obj_C_ben/GNUstep_letoltve_SVN-nel/gemas/GemasController.m:395:
undefined reference to `NSApp' 
./obj/Gemas.obj/GemasController.m.o: In function `-[GemasController
openGoToLinePanel:]': 
/home/csanyipal/Programozas/Obj_C_ben/GNUstep_letoltve_SVN-nel/gemas/GemasController.m:402:
undefined reference to `NSApp' 
./obj/Gemas.obj/GemasController.m.o: In function `-[GemasController
windowWillClose:]': 
/home/csanyipal/Programozas/Obj_C_ben/GNUstep_letoltve_SVN-nel/gemas/GemasController.m:665:
undefined reference to `NSApp' 
./obj/Gemas.obj/GemasController.m.o: In function `-[GemasController
newProject:]': 
/home/csanyipal/Programozas/Obj_C_ben/GNUstep_letoltve_SVN-nel/gemas/GemasController.m:128:
undefined reference to `NSRunAlertPanel' 
./obj/Gemas.obj/GemasController.m.o: In function `-[GemasController
applicationShouldOpenUntitledFile:]': 
/home/csanyipal/Programozas/Obj_C_ben/GNUstep_letoltve_SVN-nel/gemas/GemasController.m:629:
undefined reference to `NSInterfaceStyleForKey' 
./obj/Gemas.obj/GemasController.m.o: In function `-[GemasController
applicationShouldTerminateAfterLastWindowClosed:]': 
/home/csanyipal/Programozas/Obj_C_ben/GNUstep_letoltve_SVN-nel/gemas/GemasController.m:642:
undefined reference to `NSInterfaceStyleForKey' 
./obj/Gemas.obj/GemasController.m.o: In function `-[GemasController
newProject:]': 
/home/csanyipal/Programozas/Obj_C_ben/GNUstep_letoltve_SVN-nel/gemas/GemasController.m:259:
undefined reference to `NSRunAlertPanel' 
./obj/Gemas.obj/GemasController.m.o:(.data.rel+0x0): undefined reference
to `__objc_class_name_NSObject' 
./obj/Gemas.obj/GemasController.m.o:(.data.rel+0x10): undefined
reference to `__objc_class_name_NSKeyedArchiver' 
./obj/Gemas.obj/GemasController.m.o:(.data.rel+0x18): undefined
reference to `__objc_class_name_NSNotificationCenter' 
./obj/Gemas.obj/GemasController.m.o:(.data.rel+0x20): undefined
reference to `__objc_class_name_NSFontManager' 
./obj/Gemas.obj/GemasController.m.o:(.data.rel+0x28): undefined
reference to `__objc_class_name_NSKeyedUnarch 
./obj/Gemas.obj/GemasController.m.o:(.data.rel+0x30): undefined
reference to `__objc_class_name_NSString' 
./obj/Gemas.obj/GemasController.m.o:(.data.rel+0x38): undefined
reference to `__objc_class_name_NSFileManager' 
./obj/Gemas.obj/GemasController.m.o:(.data.rel+0x40): undefined
reference to `__objc_class_name_NSBundle' 
./obj/Gemas.obj/GemasController.m.o:(.data.rel+0x48): undefined
reference to `__objc_class_name_NSSavePanel' 
./obj/Gemas.obj/GemasController.m.o:(.data.rel+0x50): undefined
reference to `__objc_class_name_NSDocumentController' 
./obj/Gemas.obj/GemasController.m.o:(.data.rel+0x58): undefined
reference to `__objc_class_name_NSConstantString' 
./obj/Gemas.obj/GemasController.m.o:(.data.rel+0x60): undefined
reference to `__objc_class_name_NSUserDefaults' 
./obj/Gemas.obj/GemasEditorView.m.o: In function `NSMakeRange': 
/usr/include/GNUstep/Foundation/NSRange.h:156: undefined reference to
`_NSRangeExceptionRaise' 
/usr/include/GNUstep/Foundation/NSRange.h:156: undefined reference to
`_NSRangeExceptionRaise' 
/usr/include/GNUstep/Foundation/NSRange.h:156: undefined reference to
`_NSRangeExceptionRaise' 
/usr/include/GNUstep/Foundation/NSRange.h:156: undefined reference to
`_NSRangeExceptionRaise' 
/usr/include/GNUstep/Foundation/NSRange.h:156: undefined reference to
`_NSRangeExceptionRaise' 
./obj/Gemas.obj/GemasEditorView.m.o:/usr/include/GNUstep/Foundation/NSRange.h:156:
more undefined references to `_NSRangeExceptionRaise' follow 
./obj/Gemas.obj/GemasEditorView.m.o:(.data.rel+0x8): undefined reference
to `__objc_class_name_NSTextView' 
./obj/Gemas.obj/GemasEditorView.m.o:(.data.rel+0x10): undefined
reference to `__objc_class_name_NSImage' 
./obj/Gemas.obj/GemasEditorView.m.o:(.data.rel+0x20): undefined
reference to `__objc_class_name_NSString' 
./obj/Gemas.obj/GemasEditorView.m.o:(.data.rel+0x28): undefined
reference to `__objc_class_name_NSUserDefaults' 
./obj/Gemas.obj/GemasEditorView.m.o:(.data.rel+0x30): undefined
reference to `__objc_class_name_NSDictionary' 
./obj/Gemas.obj/GemasEditorView.m.o:(.data.rel+0x38): undefined
reference to `__objc_class_name_NSBundle' 
./obj/Gemas.obj/GemasEditorView.m.o:(.data.rel+0x40): undefined
reference to `__objc_class_name_NSCharacterSet' 
./obj/Gemas.obj/GemasEditorView.m.o:(.data.rel+0x48): undefined
reference to `__objc_class_name_NSConstantString' 
./obj/Gemas.obj/GemasDocument.m.o: In function `-[GemasDocument(Private)
setupNewDefaults]': 
/home/csanyipal/Programozas/Obj_C_ben/GNUstep_letoltve_SVN-nel/gemas/GemasDocument.m:77:
undefined reference to `NSForegroundColorAttributeName' 
/home/csanyipal/Programozas/Obj_C_ben/GNUstep_letoltve_SVN-nel/gemas/GemasDocument.m:77:
undefined reference to `NSBackgroundColorAttributeName' 
/home/csanyipal/Programozas/Obj_C_ben/GNUstep_letoltve_SVN-nel/gemas/GemasDocument.m:85:
undefined reference to `NSForegroundColorAttributeName' 
/home/csanyipal/Programozas/Obj_C_ben/GNUstep_letoltve_SVN-nel/gemas/GemasDocument.m:85:
undefined reference  
./obj/Gemas.obj/GemasDocument.m.o: In function `-[GemasDocument
readFromFile:ofType:]': 
/home/csanyipal/Programozas/Obj_C_ben/GNUstep_letoltve_SVN-nel/gemas/GemasDocument.m:157:
 
undefined reference to `NSRunAlertPanel' 
./obj/Gemas.obj/GemasDocument.m.o: In function `-[GemasDocument
awakeFromNib]': 
/home/csanyipal/Programozas/Obj_C_ben/GNUstep_letoltve_SVN-nel/gemas/GemasDocument.m:180:
undefined reference to `NSLigatureAttributeName' 
./obj/Gemas.obj/GemasDocument.m.o: In function `NSMakeRange': 
/usr/include/GNUstep/Foundation/NSRange.h:156: undefined reference to
`_NSRangeExceptionRaise' 
./obj/Gemas.obj/GemasDocument.m.o: In function `-[GemasDocument
revertToContentsOfURL:ofType:error:]': 
/home/csanyipal/Programozas/Obj_C_ben/GNUstep_letoltve_SVN-nel/gemas/GemasDocument.m:303:
undefined reference to `NSLigatureAttributeName' 
./obj/Gemas.obj/GemasDocument.m.o:(.data.rel+0x8): undefined reference
to `__objc_class_name_NSDocument' 
./obj/Gemas.obj/GemasDocument.m.o:(.data.rel+0x10): undefined reference
to `__objc_class_name_NSCharacterSet' 
./obj/Gemas.obj/GemasDocument.m.o:(.data.rel+0x18): undefined reference
to `__objc_class_name_NSNumber' 
./obj/Gemas.obj/GemasDocument.m.o:(.data.rel+0x20): undefined reference
to `__objc_class_name_NSBundle' 
./obj/Gemas.obj/GemasDocument.m.o:(.data.rel+0x28): undefined reference
to `__objc_class_name_NSString' 
./obj/Gemas.obj/GemasDocument.m.o:(.data.rel+0x30): undefined reference
to `__objc_class_name_NSNotificationCenter' 
./obj/Gemas.obj/GemasDocument.m.o:(.data.rel+0x38): undefined reference
to `__objc_class_name_NSDictionary' 
./obj/Gemas.obj/GemasDocument.m.o:(.data.rel+0x40): undefined reference
to `__objc_class_name_NSColor' 
./obj/Gemas.obj/GemasDocument.m.o:(.data.rel+0x48): undefined reference
to `__objc_class_name_NSKeyedUnarchiver' 
./obj/Gemas.obj/GemasDocument.m.o:(.data.rel+0x50): undefined reference
to `__objc_class_name_NSConstantString' 
./obj/Gemas.obj/GemasDocument.m.o:(.data.rel+0x58): undefined reference
to `__objc_class_name_NSUserDefaults' 
./obj/Gemas.obj/Gemas_main.m.o: In function `main': 
/home/csanyipal/Programozas/Obj_C_ben/GNUstep_letoltve_SVN-nel/gemas/Gemas_main.m:26:
undefined reference to `NSApplicationMain' 
/usr/local/lib/libHighlighterKit.so: undefined reference to
`__objc_class_name_NSMutableArray' 
/usr/local/lib/libHighlighterKit.so: undefined reference to
`NSFontAttributeName' 
/usr/local/lib/libHighlighterKit.so: undefined reference to
`__objc_class_name_NSFont' 
/usr/local/lib/libHighlighterKit.so: undefined reference to
`__objc_class_name_NSMutableDictionary' 
/usr/local/lib/libHighlighterKit.so: undefined reference to
`NSSearchPathForDirectoriesInDomains' 
/usr/local/lib/libHighlighterKit.so: undefined reference to
`__objc_class_name_NSScanner' 
/usr/local/lib/libHighlighterKit.so: undefined reference to `NSLog' 
/usr/local/lib/libHighlighterKit.so: undefined reference to
`NSTextStorageWillProcessEditingNotification' 
/usr/local/lib/libHighlighterKit.so: undefined reference to `GSDebugSet' 
/usr/local/lib/libHighlighterKit.so: undefined reference to
`__objc_class_name_NSNull' 
/usr/local/lib/libHighlighterKit.so: undefined reference to
`NSFileTypeRegular' 
collect2: ld returned 1 exit status
make[3]: *** [Gemas.app/./Gemas] Error 1
make[2]: *** [internal-app-run-compile-submake] Error 2
make[1]: *** [Gemas.all.app.variables] Error 2
make: *** [internal-all] Error 2
</output>

Any advices to solve this problem?

-- 
Regards from Pal




reply via email to

[Prev in Thread] Current Thread [Next in Thread]