[Top][All Lists]

[Date Prev][Date Next][Thread Prev][Thread Next][Date Index][Thread Index]

[Monotone-debian] Unit test failures while building monotone 0.36-1

From: Ludovic Brenta
Subject: [Monotone-debian] Unit test failures while building monotone 0.36-1
Date: Wed, 22 Aug 2007 23:36:09 +0200
User-agent: Gnus/5.110006 (No Gnus v0.6) Emacs/21.4 (gnu/linux)

Hi, I was planning to upload 0.36 at long last tonight.  Following
Zack's instructions, I unpacked the release tarball, applied the diff
from n.v.m.debian-diff, and called dpkg-buildpackage.  4 unit tests
failed, as detailed below.

Should I upload the package nevertheless?  I do not have time to
investigate, so if the answer is no, someone please provide a patch.

Note: I built in a freshly updated unstable chroot.  The installed
packages that the build depends on are:

autotools-dev                  20070725.1
cdbs                           0.4.49
debhelper                      5.0.53
libboost-dev                   1.34.1-2
libboost-regex-dev             1.34.1-2
po-debconf                     1.0.9
ps2eps                         1.64-2
texinfo                        4.8.dfsg.1-6
texlive-base                   2007-11
texlive-generic-recommended    2007-11
texlive-latex-base             2007-11
xpdf-utils                     3.02-1.1
zlib1g-dev                     1:

Interesting tests:
 97 calculation_of_unidiffs                       FAIL (line 23)
162 diffing_a_file_within_revision_outside_a_workspace FAIL (line -1)
239 logging_a_file_within_revision_outside_a_workspace FAIL (line -1)
405 test_some_hook_helper_functions               FAIL (line 7)

Of 446 tests run:
        406 succeeded
        4 failed
        35 had expected failures
        0 succeeded unexpectedly
        1 were skipped
FAIL: run_lua_tests
1 of 3 tests failed
Please report to address@hidden
make[4]: *** [check-TESTS] Error 1
make[4]: Leaving directory `/home/lbrenta/src/debian/monotone-0.36'
make[3]: *** [check-am] Error 2
make[3]: Leaving directory `/home/lbrenta/src/debian/monotone-0.36'
make[2]: *** [check-recursive] Error 1
make[2]: Leaving directory `/home/lbrenta/src/debian/monotone-0.36'
make[1]: *** [check] Error 2
make[1]: Leaving directory `/home/lbrenta/src/debian/monotone-0.36'
make: *** [debian/stamp-makefile-check] Error 2

real    42m48.106s
user    34m27.145s
sys     4m3.719s

Ludovic Brenta.

reply via email to

[Prev in Thread] Current Thread [Next in Thread]