[Top][All Lists]

[Date Prev][Date Next][Thread Prev][Thread Next][Date Index][Thread Index]

Re: [Monotone-debian] Unit test failures while building monotone 0.36-1

From: Ludovic Brenta
Subject: Re: [Monotone-debian] Unit test failures while building monotone 0.36-1
Date: Thu, 23 Aug 2007 21:43:43 +0200
User-agent: Gnus/5.110006 (No Gnus v0.6) Emacs/21.4 (gnu/linux)

Zack Weinberg writes:
> I'd appreciate it if you could pull the updates I just pushed to
> nvm.debian-diff and rebuild.  They should correct test 97, they do
> correct the aforementioned invalid_--root_settings failure, they
> incorporate a non-kluge fix for #384565 [specifically, bumping the
> build-deps on boost to 1.34.1-2 which I believe to have fixed it for
> us ;-)], and they also correct a silly packaging error
> (nvm.debian-diff never got merged from the actual release tag).  The
> rev you want is 565e5e9b94744378943083d3de0dec613ca4278a.  I'm
> attaching the .diff.gz I got, for convenience.

Thanks, Zack.  I rebuilt with one change: I combined your latest
changelog entry (0.36-2) into 0.36-1.  This is because the
.orig.tar.gz is not uploaded if the upload number isn't -1.

Unfortunately, the situation is worse now.  Not only does 97 still
fail, but I've got a new failure in 216.  I'll take your suggestion
and disable the test suite for this upload (the package fails to build
due to the test failures).  May I get write access to
n.v.m.debian-diff?  I'll send you my monotone key (GPG-signed) in

Interesting tests:
 97 calculation_of_unidiffs                       FAIL (line 23)
162 diffing_a_file_within_revision_outside_a_workspace FAIL (line -1)
216 invalid_--root_settings                       FAIL (line -1)
239 logging_a_file_within_revision_outside_a_workspace FAIL (line -1)
405 test_some_hook_helper_functions               FAIL (line 7)

Of 446 tests run:
        405 succeeded
        5 failed
        35 had expected failures
        0 succeeded unexpectedly
        1 were skipped
FAIL: run_lua_tests
1 of 3 tests failed
Please report to address@hidden
make[4]: *** [check-TESTS] Error 1
make[4]: Leaving directory `/home/lbrenta/src/debian/monotone-0.36'
make[3]: *** [check-am] Error 2
make[3]: Leaving directory `/home/lbrenta/src/debian/monotone-0.36'
make[2]: *** [check-recursive] Error 1
make[2]: Leaving directory `/home/lbrenta/src/debian/monotone-0.36'
make[1]: *** [check] Error 2
make[1]: Leaving directory `/home/lbrenta/src/debian/monotone-0.36'
make: *** [debian/stamp-makefile-check] Error 2

real    42m30.497s
user    33m40.478s
sys     4m18.512s

Ludovic Brenta.

reply via email to

[Prev in Thread] Current Thread [Next in Thread]