[Top][All Lists]

[Date Prev][Date Next][Thread Prev][Thread Next][Date Index][Thread Index]

[Linphone-developers] liblinphone SDK build failed.

From: Firman
Subject: [Linphone-developers] liblinphone SDK build failed.
Date: Tue, 15 Jan 2013 16:08:36 +0800 (SGT)

Hi everybody,
I have sifted through the mailing list archives but have not found anyone posting the same build failure problem as mine.

So I cloned the git repo for iPhone
git clone git:// --recursive

and then followed everything that the README file says about how to build the liblinphone SDK down to each letter. And then I do

sudo make all.

It failed first with the following error:

Generating configuration files for Speex, please wait....
  aclocal error: 'AM_CONFIG_HEADER': this macro is obsolete.
    You should use the 'AC_CONFIG_HEADERS' macro instead.
/opt/local/share/aclocal-1.13/obsolete-err.m4:12: AM_CONFIG_HEADER is expanded from... the top level
autom4te: /opt/local/bin/gm4 failed with exit status: 1
aclocal: error: echo failed with exit status: 1
make[1]: *** [/Users/barablu/Documents/workspace/liniphone/linphone-iphone/submodules/build/..//externals/speex/configure] Error 1
make: *** [build] Error 2

I then changed line 5 of in speex directory from

AM_CONFIG_HEADER to AC_CONFIG_HEADERS. That error went away but now I get the following error that I have no clue how to solve. Can anybody please help me? I'm using XCode 4.5, iOS SDK 6, Mac OS X Lion. Thank you.

Best regards,
Arek Malang

configure: loading site script /Users/barablu/Documents/workspace/liniphone/linphone-iphone/submodules/build/..//build/
Loading for iPhone platform=Simulator version=4.0
Selecting SDK path = /Developer/Platforms/iPhoneSimulator.platform/Developer/SDKs/iPhoneSimulator5.0.sdk
configure: error: cannot find install-sh,, or shtool in "/Users/barablu/Documents/workspace/liniphone/linphone-iphone/submodules/build/..//linphone" "/Users/barablu/Documents/workspace/liniphone/linphone-iphone/submodules/build/..//linphone/.." "/Users/barablu/Documents/workspace/liniphone/linphone-iphone/submodules/build/..//linphone/../.."
make[1]: *** [/Users/barablu/Documents/workspace/liniphone/linphone-iphone/submodules/build/../build-i386-apple-darwin/linphone/Makefile] Error 1
make: *** [build] Error 2

reply via email to

[Prev in Thread] Current Thread [Next in Thread]