discuss-gnustep
[Top][All Lists]
Advanced

[Date Prev][Date Next][Thread Prev][Thread Next][Date Index][Thread Index]

Re: Install GWorkspace To Fedora


From: Fred Kiefer
Subject: Re: Install GWorkspace To Fedora
Date: Wed, 15 May 2019 18:17:47 +0200

Again this looks like the same problem. You need to source the GNUstep.sh file 
before trying to compile any GNUstep application and of course you have to do 
this as the same user that later compiles the application.

Another question, which GNUstep packages have you already installed? Does this 
include the develop package for GNUstep gui?

Cheers,
fred

> Am 15.05.2019 um 09:44 schrieb LilZebra <address@hidden>:
> 
> OK, so I'll forget about compiling xpdf. There seems to be a binary version
> in the Fedora RPMs already, so I'm gonna use that. Hopefully it is
> compatible with this version of GNUStep.
> 
> So now when I type 'make' I get the following output an error 2:
> 
> address@hidden ~] $ cd Downloads/
> address@hidden Downloads] $ cd gworkspace-0.9.4/
> address@hidden gworkspace-0.9.4] $ make
> This is gnustep-make 2.7.0. Type 'gmake print-gnustep-make-help' for help.
> Running in gnustep-make version 2 strict mode.
> Making all in FSNode ...
> Making build-headers for framework FSNode...
> Making all for framework FSNode...
> Compiling file FSNode.m ...
> FSNode.m:26:9: *fatal error:* AppKit/AppKit.h: No such file or directory
> #import *<AppKit/AppKit.h>*
>         ^~~~~~~~~~~~~~~~~
> compilation terminated.
> gmake[3]: *** [/usr/lib64/GNUstep/Makefiles/rules.make:479:
> obj/FSNode.obj/FSNode.m.o] Error 1
> gmake[2]: *** [/usr/lib64/GNUstep/Makefiles/Instance/framework.make:612:
> internal-framework-run-compile-submake] Error 2
> gmake[1]: *** [/usr/lib64/GNUstep/Makefiles/Master/rules.make:297:
> FSNode.all.framework.variables] Error 2
> make: ***
> [/usr/lib64/GNUstep/Makefiles/Master/serial-subdirectories.make:53:
> internal-all] Error 2
> address@hidden gworkspace-0.9.4] $ 
> 



reply via email to

[Prev in Thread] Current Thread [Next in Thread]