[Top][All Lists]

[Date Prev][Date Next][Thread Prev][Thread Next][Date Index][Thread Index]

[bug-mailutils] v2.1 build failure

From: Simon Josefsson
Subject: [bug-mailutils] v2.1 build failure
Date: Wed, 16 Sep 2009 16:55:40 +0200
User-agent: Gnus/5.110011 (No Gnus v0.11) Emacs/23.1 (gnu/linux)

Hi.  Congratulations on the release!

I'm building it to setup a IMAP server with SCRAM-SHA-1 support via GNU
SASL.  I'm running into a build error:

make[3]: Leaving directory `/root/mailutils-2.1/mail/testsuite'
make[3]: Entering directory `/root/mailutils-2.1/mail'
gcc -DHAVE_CONFIG_H -I. -I.. -I. -I../include -I../lib -I../lib -I.. 
-I../include -I../mailbox -I../libmu_argp -I../libmu_cfg    
-DSYSCONFDIR=\"/usr/local/etc\" -DSITE_MAIL_RC=\"/usr/local/etc/mail.rc\" -g 
-MT table.o -MD -MP -MF .deps/table.Tpo -c -o table.o table.c
table.c:126: error: ‘mailvar_set_compl’ undeclared here (not in a function)
make[3]: *** [table.o] Error 1
make[3]: Leaving directory `/root/mailutils-2.1/mail'
make[2]: *** [all-recursive] Error 1
make[2]: Leaving directory `/root/mailutils-2.1/mail'
make[1]: *** [all-recursive] Error 1
make[1]: Leaving directory `/root/mailutils-2.1'
make: *** [all] Error 2

Any ideas?


reply via email to

[Prev in Thread] Current Thread [Next in Thread]