[Top][All Lists]

[Date Prev][Date Next][Thread Prev][Thread Next][Date Index][Thread Index]

Re: [bug-mailutils] Build failure with latest snapshots

From: Sergey Poznyakoff
Subject: Re: [bug-mailutils] Build failure with latest snapshots
Date: Sun, 05 Mar 2006 00:28:47 EET

Jordi Mallach <address@hidden> wrote:

> checking size of off_t... configure: error: cannot compute sizeof (off_t), 77
> I don't have config.log for this, I'd have to request it from buildd
> admins.

Please do, I will need it to analyze the reasons.

> page.c:22: error: conflicting types for 'cursor'
> mail.h:177: error: previous declaration of 'cursor' was here

Should be size_t in both files, thanks for reporting.


reply via email to

[Prev in Thread] Current Thread [Next in Thread]