[Top][All Lists]

[Date Prev][Date Next][Thread Prev][Thread Next][Date Index][Thread Index]

[bug-mailutils] Build failure with latest snapshots

From: Jordi Mallach
Subject: [bug-mailutils] Build failure with latest snapshots
Date: Sat, 4 Mar 2006 19:01:02 +0100
User-agent: Mutt/1.5.11+cvs20060126

I've uploaded a recent snapshot to Debian, which still had 0.6.90, and
it's had a few hiccups on arm, s390, alpha and ia64.

The arm failure is tricky for me, any hint on this?

checking for off_t... (cached) yes
checking size of off_t... configure: error: cannot compute sizeof (off_t), 77

I don't have config.log for this, I'd have to request it from buildd

alpha, ia64 and s390 fail with:

if cc -DHAVE_CONFIG_H -I. -I. -I.. -I. -I../include -I../lib -I.. -I../include 
-I../include/mailutils/gnu -I../mailbox     -DSYSCONFDIR=\"/etc\" 
-DSITE_MAIL_RC=\"/etc/mail.rc\" -g -Wall -O2 -MT page.o -MD -MP -MF 
".deps/page.Tpo" -c -o page.o page.c; \
        then mv -f ".deps/page.Tpo" ".deps/page.Po"; else rm -f 
".deps/page.Tpo"; exit 1; fi
page.c:22: error: conflicting types for 'cursor'
mail.h:177: error: previous declaration of 'cursor' was here
make[4]: *** [page.o] Error 1
make[4]: Leaving directory `/build/buildd/mailutils-0.6.93/mail'

(size_t vs unsigned int) 

The rest seem to do well, and don't ask me why, my random testsuite
failures are gone, apparently. Maybe that's because I'm building on an
ext3 partition, though.

Jordi Mallach PĂ©rez  --  Debian developer     http://www.debian.org/
address@hidden     address@hidden     http://www.sindominio.net/
GnuPG public key information available at http://oskuro.net/

Attachment: signature.asc
Description: Digital signature

reply via email to

[Prev in Thread] Current Thread [Next in Thread]