[Top][All Lists]

[Date Prev][Date Next][Thread Prev][Thread Next][Date Index][Thread Index]

Re: [GnuCOBOL 3.1.2] testsuite: 783 796 failed after 'make check'

From: Simon Sobisch
Subject: Re: [GnuCOBOL 3.1.2] testsuite: 783 796 failed after 'make check'
Date: Fri, 19 Nov 2021 11:54:58 +0100
User-agent: Mozilla/5.0 (Windows NT 10.0; Win64; x64; rv:91.0) Gecko/20100101 Thunderbird/91.3.1

That came up already more than once, the last time was 8 days ago,
please see the archive:

Summary: those two are false-positives, if you want to install that go
ahead, but Cygwin is definitely not the environment I'd suggest anyone
to use for GnuCOBOL with the sole exception of "I use Cygwin for
everything else", in which case it is fine to use GnuCOBOL on Cygwin.


Am 19.11.2021 um 10:21 schrieb Barry Yu:
Dear GnuCOBOL expert team,

Re: After ‘Make Check’

Really sorry to bothering you about the ‘Make Check’ problem with below
messages ?!

make[3]: *** [Makefile:788: check-local] Error 1

make[3]: Leaving directory '/cygdrive/c/OC/gnucobol-3.1.2/tests'

make[2]: *** [Makefile:665: check-am] Error 2

make[2]: Leaving directory '/cygdrive/c/OC/gnucobol-3.1.2/tests'

make[1]: *** [Makefile:513: check-recursive] Error 1

make[1]: Leaving directory '/cygdrive/c/OC/gnucobol-3.1.2/tests'

make: *** [Makefile:626: check-recursive] Error 1

Please kindly advise if testsuite.log could provide some hints to
proceed to ‘Make Install’ ?

Honestly, I am not professional enough to tell what went wrong!

Hope to hear from you soon. In the mean time I could only

Look at the surface of those two unexpected errors!

Thank you so much for your time!

Warm regards,


reply via email to

[Prev in Thread] Current Thread [Next in Thread]