[Top][All Lists]

[Date Prev][Date Next][Thread Prev][Thread Next][Date Index][Thread Index]

[GnuCOBOL 3.1.2] testsuite: 783 796 failed after 'make check'

From: Barry Yu
Subject: [GnuCOBOL 3.1.2] testsuite: 783 796 failed after 'make check'
Date: Fri, 19 Nov 2021 09:21:15 +0000

Dear GnuCOBOL expert team,


Re: After ‘Make Check’


Really sorry to bothering you about the ‘Make Check’ problem with below messages ?!


make[3]: *** [Makefile:788: check-local] Error 1

make[3]: Leaving directory '/cygdrive/c/OC/gnucobol-3.1.2/tests'

make[2]: *** [Makefile:665: check-am] Error 2

make[2]: Leaving directory '/cygdrive/c/OC/gnucobol-3.1.2/tests'

make[1]: *** [Makefile:513: check-recursive] Error 1

make[1]: Leaving directory '/cygdrive/c/OC/gnucobol-3.1.2/tests'

make: *** [Makefile:626: check-recursive] Error 1


Please kindly advise if testsuite.log could provide some hints to proceed to ‘Make Install’ ?


Honestly, I am not professional enough to tell what went wrong!


Hope to hear from you soon. In the mean time I could only


Look at the surface of those two unexpected errors!


Thank you so much for your time!


Warm regards,





Attachment: testsuite.log
Description: testsuite.log

reply via email to

[Prev in Thread] Current Thread [Next in Thread]