[Top][All Lists]

[Date Prev][Date Next][Thread Prev][Thread Next][Date Index][Thread Index]

coreutils.593 make check TEST failed

From: gmick beale
Subject: coreutils.593 make check TEST failed
Date: Sat, 12 Nov 2005 23:28:27 -0700
User-agent: Thunderbird 1.5 (Macintosh/20051025)

Making check in chown
make  check-TESTS
FAIL: basic
PASS: deref
PASS: separator
1 of 3 tests failed
Please report to address@hidden
make[3]: *** [check-TESTS] Error 1
make[2]: *** [check-am] Error 2
make[1]: *** [check-recursive] Error 1
make: *** [check-recursive] Error 1
[The-Sandbox:~/coreutilsbuild/coreutils-5.93] mick%  sudo make check-root
cd tests && make check-root
cd chown && make check TESTS=basic
make  check-TESTS
FAIL: basic

Installing coreutils-5.93 on an IMac 1 ghz  OS 10.2.8
User is Admin group
Last command given:  sudo make check-root

G mick Beale

reply via email to

[Prev in Thread] Current Thread [Next in Thread]