[Top][All Lists]

[Date Prev][Date Next][Thread Prev][Thread Next][Date Index][Thread Index]

make asked me to report this bug

From: Mary Anderson
Subject: make asked me to report this bug
Date: Fri, 11 Nov 2005 15:06:10 -0800 (PST)

   I am compiling coreutils.5.93 on an IBM Thinkpad running RedHat
Enterprise Linux (most recent version.) make check reported that one test
1 of 8 tests failed
Please report to address@hidden
make[3]: *** [check-TESTS] Error 1
make[3]: Leaving directory `/root/Desktop/coreutils-5.93/tests/chmod'
make[2]: *** [check-am] Error 2
make[2]: Leaving directory `/root/Desktop/coreutils-5.93/tests/chmod'
make[1]: *** [check-recursive] Error 1
make[1]: Leaving directory `/root/Desktop/coreutils-5.93/tests'
make: *** [check-recursive] Error 1

Mary Anderson

reply via email to

[Prev in Thread] Current Thread [Next in Thread]