[Top][All Lists]

[Date Prev][Date Next][Thread Prev][Thread Next][Date Index][Thread Index]

[Axiom-developer] CVS build broken? -- errortrap

From: Camm Maguire
Subject: [Axiom-developer] CVS build broken? -- errortrap
Date: 10 Oct 2003 09:51:59 -0400
User-agent: Gnus/5.09 (Gnus v5.9.0) Emacs/21.2

Greetings!  Just went to build a fresh cvs snapshot Debian package
yesterday (to include some of the tutorial documentation developed --
this stuff is great!), and the build appears to be broken due to
missing files:

313 making /fix/g/camm/axiom/axiom-0.0.0cvs/int/input/eqtbl.input from 
312 making /fix/g/camm/axiom/axiom-0.0.0cvs/mnt/linux/input/eqtbl.input from 
315 making /fix/g/camm/axiom/axiom-0.0.0cvs/int/input/equation.input from 
314 making /fix/g/camm/axiom/axiom-0.0.0cvs/mnt/linux/input/equation.input from 
make[4]: *** No rule to make target 
`/fix/g/camm/axiom/axiom-0.0.0cvs/src/input/errortrap.input.pamphlet', needed 
by `/fix/g/camm/axiom/axiom-0.0.0cvs/int/input/errortrap.input'.  Stop.
make[4]: Leaving directory `/fix/g/camm/axiom/axiom-0.0.0cvs/src/input'
make[3]: *** [inputdir] Error 2
make[3]: Leaving directory `/fix/g/camm/axiom/axiom-0.0.0cvs/src'
make[2]: *** [srcdir] Error 2
make[2]: Leaving directory `/fix/g/camm/axiom/axiom-0.0.0cvs'
make[1]: *** [all] Error 2
make[1]: Leaving directory `/fix/g/camm/axiom/axiom-0.0.0cvs'
make: *** [build-stamp] Error 2
debuild: fatal error at line 469:
dpkg-buildpackage failed!

Any advice?

Take care,

Camm Maguire                                            address@hidden
"The earth is but one country, and mankind its citizens."  --  Baha'u'llah

reply via email to

[Prev in Thread] Current Thread [Next in Thread]