[Top][All Lists]

[Date Prev][Date Next][Thread Prev][Thread Next][Date Index][Thread Index]

[Weechat-dev] [bug #40907] Error when compiling perl support

From: anonymous
Subject: [Weechat-dev] [bug #40907] Error when compiling perl support
Date: Mon, 16 Dec 2013 09:05:16 +0000
User-agent: Mozilla/5.0 (Macintosh; Intel Mac OS X 10.9; rv:26.0) Gecko/20100101 Firefox/26.0


                 Summary: Error when compiling perl support
                 Project: WeeChat
            Submitted by: None
            Submitted on: Mon 16 Dec 2013 09:05:15 AM UTC
                Category: compilation
                Severity: 3 - Normal
              Item Group: compile/install
                  Status: None
                 Privacy: Public
             Assigned to: None
         Originator Name: 
        Originator Email: address@hidden
             Open/Closed: Open
         Discussion Lock: Any
                 Release: 0.4.2
                IRC nick: 



Running CentOS 6.5 64-bit with Perl 5.18.1.

When running 'make' I get the following:

[ 78%] Building C object src/plugins/xfer/CMakeFiles/xfer.dir/xfer-upgrade.o
Linking C shared module xfer.so
[ 78%] Built target xfer
[ 79%] Building C object src/plugins/perl/CMakeFiles/perl.dir/weechat-perl.o
[ 79%] Building C object
Linking C shared module perl.so
/usr/bin/ld: /usr/local/lib/perl5/5.18.1/x86_64-linux/CORE/libperl.a(op.o):
relocation R_X86_64_32S against `PL_sv_yes' can not be used when making a
shared object; recompile with -fPIC
/usr/local/lib/perl5/5.18.1/x86_64-linux/CORE/libperl.a: could not read
symbols: Bad value
collect2: ld returned 1 exit status
make[2]: *** [src/plugins/perl/perl.so] Error 1
make[1]: *** [src/plugins/perl/CMakeFiles/perl.dir/all] Error 2
make: *** [all] Error 2


Reply to this item at:


  Message sent via/by Savannah

reply via email to

[Prev in Thread] Current Thread [Next in Thread]