[Top][All Lists]

[Date Prev][Date Next][Thread Prev][Thread Next][Date Index][Thread Index]

[Texmacs-dev] qt failing to compile again

From: Sam Liddicott
Subject: [Texmacs-dev] qt failing to compile again
Date: Tue, 09 Nov 2010 16:20:08 -0000
User-agent: Mozilla/5.0 (X11; U; Linux i686; en-US; rv: Gecko/20101108 Lanikai/3.1.7pre

Freshly updated to svn head:

In file included from ./Plugins/Qt/QTMMenuHelper.cpp:13:
./Plugins/Qt/QTMMenuHelper.hpp:85: error: ‘QLineEdit’ was not declared in this scope
./Plugins/Qt/QTMMenuHelper.hpp:85: error: template argument 1 is invalid
./Plugins/Qt/QTMMenuHelper.hpp:91: error: ‘QLineEdit’ has not been declared
make[1]: *** [Objects/QTMMenuHelper.o] Error 1

It used to compile on that machine - is it a new breakage that someone here recognizes?

          Associate Member #2325]

reply via email to

[Prev in Thread] Current Thread [Next in Thread]