[Top][All Lists]

[Date Prev][Date Next][Thread Prev][Thread Next][Date Index][Thread Index]

[Swftools-common] Make fails on Fedora Core 1

From: Giovanni
Subject: [Swftools-common] Make fails on Fedora Core 1
Date: Tue, 30 Dec 2003 10:33:30 +0100

  Hi all,

I'm trying to compile the latest tar.gz available from the swftools site
(swftools-2003-12-07-1129), but whitout success. Here's what appens:

$ ./configure --prefix=/usr/ (everything seems fine)
$ make
cd avi2swf;make all
make[1]: Entering directory `/home/gio/swftools-2003-12-07-1129/avi2swf'
c++ -c -DHAVE_CONFIG_H   -I/usr//include -Wparentheses -Wimplicit
-Wreturn-type -O -fomit-frame-pointer  -I/usr/include/freetype2
`avifile-config --cflags` avi2swf.cc -o avi2swf.o In file included from
avi2swf.cc:48:/usr/include/avifile-0.7/fourcc.h:4:2: warning: #warning
Use #include "avm_fourcc.h" instead In file included from avi2swf.cc:49:
/usr/include/avifile-0.7/creators.h:4:2: warning: #warning Use #include
"avm_creators.h" instead gcc -c -DHAVE_CONFIG_H   -I/usr//include
-Wparentheses -Wimplicit -Wreturn-type -O -fomit-frame-pointer 
-I/usr/include/freetype2 v2swf.c -o v2swf.o v2swf.c: In function
`getSamples': v2swf.c:165: error: `swf_mp3_in_samplerate' undeclared
(first use in this function) v2swf.c:165: error: (Each undeclared
identifier is reported only once v2swf.c:165: error: for each function
it appears in.) v2swf.c: At top level:
v2swf.c:195: error: `swf_mp3_in_samplerate' used prior to declaration
make[1]: *** [v2swf.o] Error 1
make[1]: Leaving directory `/home/gio/swftools-2003-12-07-1129/avi2swf'
make: *** [all] Error 2


My sistem:
Fedora Core 1
kernel 2.4.23 vanilla
gcc 3.3.2


Un giorno le macchine riusciranno a risolvere tutti i problemi,
ma mai nessuna di esse potra' porne uno.
                -- Albert Einstein

reply via email to

[Prev in Thread] Current Thread [Next in Thread]