[Top][All Lists]

[Date Prev][Date Next][Thread Prev][Thread Next][Date Index][Thread Index]

Re: Problem with variable renaming on Mac OS homebrew Arm

From: Friedrich Beckmann
Subject: Re: Problem with variable renaming on Mac OS homebrew Arm
Date: Sat, 4 Nov 2023 11:13:02 +0100

Hi Sam,

thanks for your test. Can you say which MacOS version and which hardware you 
are using? There is
currently a report that pspp latest fails the regression tests on MacOS 14 
Sonoma. The
problem is described here:

There should be a temporary build directory similar to


Could you go there and find the file „tests/testsuite.log“. That file contains 
a detailed report
about the failing tests. Could you locate and send that file?



> Am 04.11.2023 um 11:04 schrieb Sam 
> Hmmm, it still cannot be installed.  
> make[3]: *** [tests_check] Error 1
> make[2]: *** [check-am] Error 2
> make[1]: *** [check-recursive] Error 1
> make: *** [check] Error 2
> Sent with Proton Mail secure email.
> ------- Original Message -------
> On Saturday, November 4th, 2023 at 5:01 PM, Friedrich Beckmann 
>> Hi Sam,
>> the current nightly should now build. Could you give that a try? Can you 
>> install with
>> brew install —-head —-verbose pspp ?
>> Can you also say which MacOS version you are using?
>> Regards
>> Friedrich

reply via email to

[Prev in Thread] Current Thread [Next in Thread]