[Top][All Lists]

[Date Prev][Date Next][Thread Prev][Thread Next][Date Index][Thread Index]

Re: [OATH-toolkit-help] OATH Toolkit 1.6.0

From: Jean-Michel Pouré - GOOZE
Subject: Re: [OATH-toolkit-help] OATH Toolkit 1.6.0
Date: Tue, 22 Feb 2011 21:42:11 +0100

Le mardi 22 février 2011 à 20:54 +0100, Simon Josefsson a écrit :
> Debian packages won't be official until they have made it their way
> through the NEW queue, which can take some time. 

Dear Simon,

We added Mentors to /etc/apt/sources.list:
deb-src http://mentors.debian.net/debian/ unstable main contrib non-free

Then issued: 
apt-get build-dep
apt-get source --build oath-toolkit

There is an error related to AMD64:

*** Warning: Linking the executable test-pam_oath-root against the
loadable module
*** pam_oath.so is not portable!
libtool: link: gcc -g -O2 -g -Wall -O2 -o test-pam_oath-root
test-pam_oath-root.o  ../.libs/pam_oath.so 
 -lpam -Wl,-rpath 
-Wl,-rpath -Wl,/lib/security
make[5]: Nothing to be done for `run-root-tests.sh'.
make[5]: Leaving directory
/usr/bin/make  check-TESTS
make[5]: Entering directory
rc 4
PASS: test-pam_oath
pam_authenticate[0] 28
FAIL: run-root-tests.sh
1 of 2 tests failed
Please report to address@hidden
make[5]: *** [check-TESTS] Error 1
make[5]: Leaving directory
make[4]: *** [check-am] Error 2
make[4]: Leaving directory
make[3]: *** [check-recursive] Error 1
make[3]: Leaving directory
make[2]: *** [check-recursive] Error 1
make[2]: Leaving directory
make[1]: *** [check] Erreur 2
make[1]: quittant le répertoire
« /home/jmpoure/Documents/logiciels/deb/oath-toolkit-1.6.0 »
make: *** [debian/stamp-makefile-check] Erreur 2
dpkg-buildpackage: erreur: debian/rules build a produit une erreur de
sortie de type 2
La commande de construction « cd oath-toolkit-1.6.0 && dpkg-buildpackage
-b -uc » a échoué.
E: Échec du processus fils

Hope this helps.

Kind regards,
                  Jean-Michel Pouré - Gooze - http://www.gooze.eu

reply via email to

[Prev in Thread] Current Thread [Next in Thread]