[Top][All Lists]

[Date Prev][Date Next][Thread Prev][Thread Next][Date Index][Thread Index]

Re: [Mingw-cross-env-list] nsis build failed

From: Jamie Lahowetz
Subject: Re: [Mingw-cross-env-list] nsis build failed
Date: Thu, 17 May 2012 09:17:59 -0500

I solved it so far. I needed to install g++-4.4-multilib and libc6-dev-i386.

On Wed, May 16, 2012 at 2:29 PM, Jamie Lahowetz <address@hidden> wrote:
I got this error after an attempt to build nsis using the make call:
[build]    nsis

Failed to build package nsis!
/usr/include/gnu/stubs.h:7: fatal error: gnu/stubs-32.h: No such file or directory
compilation terminated.
scons: *** [build/release/makensis/build.o] Error 1
scons: building terminated because of errors.
make[1]: *** [build-only-nsis] Error 2
make[1]: Leaving directory `/home/jamie.lahowetz/mxe'
real    0m21.761s
user    0m16.850s
sys    0m1.920s
[log]      /home/jamie.lahowetz/mxe/log/nsis

make: *** [/home/jamie.lahowetz/mxe/usr/installed/nsis] Error 1

Jamie Ryan Lahowetz
University of Nebraska - Lincoln
Graduate Student - Geosciences

reply via email to

[Prev in Thread] Current Thread [Next in Thread]