[Top][All Lists]

[Date Prev][Date Next][Thread Prev][Thread Next][Date Index][Thread Index]

Making test-baseline fails

From: Martín Rincón Botero
Subject: Making test-baseline fails
Date: Sat, 19 Nov 2022 18:31:16 +0100


I'm trying to make a new test-baseline for the automated regression tests.
This time I'm not able to do it. I made first make clean and then make
test-baseline checking out the current git master all while being inside of
the build directory. After a while I get:

testing /home/martin-ribot/dev/lilypond/scripts/build/
ERROR: In procedure apply-smob/1:
In procedure primitive-load-path: Unable to find file "lily/lily" in load
test results in  ./out/test-output-distance
/usr/lib/python3/dist-packages/apport/ DeprecationWarning: the
imp module is deprecated in favour of importlib and slated for removal in
Python 3.12; see the module's documentation for alternative uses
  import fnmatch, glob, traceback, errno, sys, atexit, locale, imp, stat
Traceback (most recent call last):
  File "/home/martin-ribot/dev/lilypond/scripts/build/",
line 1366, in <module>
  File "/home/martin-ribot/dev/lilypond/scripts/build/",
line 1354, in main
  File "/home/martin-ribot/dev/lilypond/scripts/build/",
line 1300, in run_tests
  File "/home/martin-ribot/dev/lilypond/scripts/build/",
line 1287, in test_basic_compare
    system(' '.join(args))
  File "/home/martin-ribot/dev/lilypond/scripts/build/",
line 67, in system["/bin/bash", "-c", c.encode('utf-8')], check=True,
  File "/usr/lib/python3.10/", line 524, in run
    raise CalledProcessError(retcode, process.args,
subprocess.CalledProcessError: Command '['/bin/bash', '-c',
-dseparate-page-formats=ps -daux-files -dtall-page-formats=ps --formats=ps
-dseparate-log-files -dinclude-eps-fonts -dgs-load-fonts --header=texidoc
-dcheck-internal-types -danti-alias-factor=1 20 19 20grob 20multipage
19multipage added removed']' returned non-zero exit
status 1.
make[2]: ***
local-test] Error 1
make[1]: *** [/home/martin-ribot/dev/lilypond/build/../
test] Error 2
make: *** [/home/martin-ribot/dev/lilypond/build/../
test-baseline-pre] Error 2


reply via email to

[Prev in Thread] Current Thread [Next in Thread]