[Top][All Lists]

[Date Prev][Date Next][Thread Prev][Thread Next][Date Index][Thread Index]

Debug make test failure

From: Jean Abou Samra
Subject: Debug make test failure
Date: Mon, 5 Oct 2020 00:24:13 +0200
User-agent: Mozilla/5.0 (X11; Linux x86_64; rv:68.0) Gecko/20100101 Thunderbird/68.10.0


I'm tracking down a failure of make test (

The output is:

Command '/builds/lilypond/lilypond/build/out/bin/lilypond \
-I /builds/lilypond/lilypond/input/regression -dbackend=eps --formats=ps -djob-count=20 -dseparate-log-files -dinclude-eps-fonts -dgs-load-fonts --header=texidoc -I /builds/lilypond/lilypond/Documentation/included/ -dcheck-internal-types -ddump-signatures -danti-alias-factor=1 -I "./" -I "/builds/lilypond/lilypond/build/input/regression" -I "/builds/lilypond/lilypond/input/regression" --formats=eps -deps-box-padding=3.000000 -dread-file-list -dno-strip-output-dir "/builds/lilypond/lilypond/build/out/lybook-testdb/"' returned non-zero exit status 1
/builds/lilypond/lilypond/build/.././make/ly-rules.make:35: recipe for target 'out-test/collated-files.texi' failed
make[2]: *** [out-test/collated-files.texi] Error 1
/builds/lilypond/lilypond/build/.././make/lysdoc-targets.make:18: recipe for target 'lysdoc-test' failed
make[1]: *** [lysdoc-test] Error 2
/builds/lilypond/lilypond/build/../ recipe for target 'test' failed|
make: *** [test] Error 2|

|From this, is there a way I can view which file failed?



reply via email to

[Prev in Thread] Current Thread [Next in Thread]