[Top][All Lists]

[Date Prev][Date Next][Thread Prev][Thread Next][Date Index][Thread Index]

Error compiling octave-2.1.49

From: abarto
Subject: Error compiling octave-2.1.49
Date: Sun, 01 Jun 2003 21:03:34 -0300

I was building octave-2.1.49 on cygwin and I captured the following errors. Any hints?

Makefile:30: *** missing separator.  Stop.
make[3]: *** [src-DOCSTRINGS] Error 2
make[2]: *** [interpreter] Error 2
make[1]: *** [doc] Error 2
make: *** [all] Error 2

reply via email to

[Prev in Thread] Current Thread [Next in Thread]