[Top][All Lists]

[Date Prev][Date Next][Thread Prev][Thread Next][Date Index][Thread Index]

building 2.0.1 sunOS4.1.3

From: Djossou Coco 0251858170
Subject: building 2.0.1 sunOS4.1.3
Date: Tue, 21 Jan 1997 15:26:25 +0100

Building octave-2.0.1 on SPARCstation-10 sunOS4.1.4 stops on the file in src directory.
./configure --prefix=/usr/local/gnu > & ../configure.log
make CFLAGS=-O CXXFLAGS=-O LDFLAGS= > & ../all.log

-rw-r--r--   1 djossou  staff       85650 Jan 21 13:44 all.log
-rw-r--r--   1 djossou  staff       20116 Jan 21 12:23 configure.log
The output of ./configure and make are available
I can grep information in them if it could help.
Any idea will be welcome,
Thanks in advance,
Coco D.

mm-498% uname -a
SunOS mm 4.1.4 1 sun4m
mm-499% make --version
GNU Make version 3.75, by Richard Stallman and Roland McGrath.
mm-500% gcc --version
mm-501% makeinfo --version
GNU Makeinfo (Texinfo 3.9) 1.67
mm-508% tail -15 all.log
c++ -c  -I. -I.. -I../liboctave -I../src -I../glob -I../libcruft/misc  
-DHAVE_CONFIG_H  -fno-implicit-templates  -O In function `void my_friendly_exit(const char *, int)': passing `void (*)()' as argument 2 of 
`octave_set_signal_handler(int, void (*)(int))' In function `void (* octave_set_signal_handler(int, void 
(*)(int)))(int)': warning: ANSI C++ prohibits conversion from `(int)' to 
`(...)' In function `struct octave_interrupt_handler * 
octave_ignore_interrupts()': passing `void (*)()' as argument 2 of 
`octave_set_signal_handler(int, void (*)(int))' In function `void install_signal_handlers()': passing `void (*)()' as argument 2 of 
`octave_set_signal_handler(int, void (*)(int))' passing `void (*)()' as argument 2 of 
`octave_set_signal_handler(int, void (*)(int))'
make[2]: *** [sighandlers.o] Error 1
make[2]: Leaving directory `/netsrc/src/gnu/current/octave-2.0.1/src'
make[1]: *** [src] Error 2
make[1]: Leaving directory `/netsrc/src/gnu/current/octave-2.0.1'
make: *** [all] Error 2

reply via email to

[Prev in Thread] Current Thread [Next in Thread]