[Top][All Lists]

[Date Prev][Date Next][Thread Prev][Thread Next][Date Index][Thread Index]

[Guile-commits] Hydra job gnu:guile-2-0:build on x86_64-darwin, build 29

From: Hydra Build Daemon
Subject: [Guile-commits] Hydra job gnu:guile-2-0:build on x86_64-darwin, build 2967857: Failed with non-zero exit code
Date: Sat, 25 Aug 2012 15:12:38 +0200


This is to let you know that Hydra build 2967857 of job gnu:guile-2-0:build has 
changed from 'Success' to 'Failed with non-zero exit code'.

Complete build information can be found on this page:

The last 50 lines of the build log are shown at the bottom of this email.

A summary of the build information follows:

Build ID:              | 2967857
Nix name:              | guile-0
Short description:     | Native Nix build on x86_64-darwin
Maintainer(s):         | address@hidden
System:                | x86_64-darwin
Derivation store path: | /nix/store/i9g3qjzma0ixay9v9qcgn1vmsarfb5gi-guile-0.drv
Output store path:     | /nix/store/h6adrqz3h201z7iw565bfys62630y2lp-guile-0
Time added:            | 2012-08-25 15:12:38
Build started:         | 2012-08-25 14:19:40
Build finished:        | 2012-08-25 15:12:38
Duration:              | 3178s

The build inputs were:

Name        | Type   | Value
hydraConfig | git    | 
nixpkgs     | git    | 
guile       | git    | 
system      | string | x86_64-darwin


The Hydra build daemon.

Running sxml.transform.test
Running sxml.xpath.test
Running symbols.test
Running syncase.test
Running syntax.test
UNRESOLVED: syntax.test: letrec: bindings: initial bindings are undefined
UNRESOLVED: syntax.test: letrec*: bindings: initial bindings are undefined
Running texinfo.docbook.test
Running texinfo.serialize.test
Running texinfo.string-utils.test
Running texinfo.test
FAIL: texinfo.test: test-texinfo->stexinfo: @url{arg}
Running threads.test
Running time.test
Running tree-il.test
UNRESOLVED: tree-il.test: warnings: unused-toplevel: used by macro
Running version.test
UNRESOLVED: version.test: version reporting works
Running vlist.test
Running weaks.test
Running web-http.test
Running web-request.test
Running web-response.test
Running web-uri.test

Totals for this test run:
passes:                 35019
failures:               1
unexpected passes:      0
expected failures:      30
unresolved test cases:  39
untested test cases:    1
unsupported test cases: 9
errors:                 0

FAIL: check-guile
1 of 1 test failed
Please report to address@hidden
make[3]: *** [check-TESTS] Error 1
make[3]: Leaving directory 
make[2]: *** [check-am] Error 2
make[2]: Leaving directory 
make[1]: *** [check-recursive] Error 1
make[1]: Leaving directory 
make: *** [check] Error 2
build time elapsed:  0m0.026s 0m0.013s 21m39.139s 1m13.256s
builder for `/nix/store/i9g3qjzma0ixay9v9qcgn1vmsarfb5gi-guile-0.drv' failed 
with exit code 2
error: build of `/nix/store/i9g3qjzma0ixay9v9qcgn1vmsarfb5gi-guile-0.drv' failed

reply via email to

[Prev in Thread] Current Thread [Next in Thread]