[Top][All Lists]

[Date Prev][Date Next][Thread Prev][Thread Next][Date Index][Thread Index]

[Guile-commits] Hydra job gnu:guile-2-0:tarball build 1295477: Failed

From: Hydra Build Daemon
Subject: [Guile-commits] Hydra job gnu:guile-2-0:tarball build 1295477: Failed
Date: Fri, 2 Sep 2011 13:55:54 +0200


This is to let you know that Hydra build 1295477 of job gnu:guile-2-0:tarball 
has changed from 'Success' to 'Failed'.

Complete build information can be found on this page:

The last 50 lines of the build log are shown at the bottom of this email.

A summary of the build information follows:

Build ID:              | 1295477
Nix name:              | 
Short description:     | Build of a source distribution from a checkout
Maintainer(s):         | address@hidden
System:                | x86_64-linux
Derivation store path: | 
Output store path:     | 
Time added:            | 2011-09-02 13:55:54
Build started:         | 2011-09-02 13:46:09
Build finished:        | 2011-09-02 13:55:54
Duration:              | 585s

The build inputs were:

Name        | Type | Value
hydraConfig | svn  |
nixpkgs     | svn  |
guileSrc    | git  | 


The Hydra build daemon.

wrote `srfi/srfi-18.go'
building srfi/srfi-19.go
  GUILEC srfi/srfi-19.go
wrote `srfi/srfi-19.go'
building srfi/srfi-26.go
  GUILEC srfi/srfi-26.go
wrote `srfi/srfi-26.go'
building srfi/srfi-27.go
  GUILEC srfi/srfi-27.go
wrote `srfi/srfi-27.go'
building srfi/srfi-31.go
  GUILEC srfi/srfi-31.go
wrote `srfi/srfi-31.go'
building srfi/srfi-34.go
  GUILEC srfi/srfi-34.go
wrote `srfi/srfi-34.go'
building srfi/srfi-35.go
  GUILEC srfi/srfi-35.go
wrote `srfi/srfi-35.go'
building srfi/srfi-37.go
  GUILEC srfi/srfi-37.go
wrote `srfi/srfi-37.go'
building srfi/srfi-38.go
  GUILEC srfi/srfi-38.go
wrote `srfi/srfi-38.go'
building srfi/srfi-42.go
  GUILEC srfi/srfi-42.go
wrote `srfi/srfi-42.go'
building srfi/srfi-39.go
  GUILEC srfi/srfi-39.go
wrote `srfi/srfi-39.go'
building srfi/srfi-45.go
  GUILEC srfi/srfi-45.go
wrote `srfi/srfi-45.go'
building srfi/srfi-60.go
  GUILEC srfi/srfi-60.go
wrote `srfi/srfi-60.go'
building srfi/srfi-67.go
  GUILEC srfi/srfi-67.go
ice-9/boot-9.scm:119:20: In procedure #<procedure 141eeb0 at 
ice-9/boot-9.scm:110:6 (thrown-k . args)>:
ice-9/boot-9.scm:119:20: Syntax error:
srfi/srfi-67/compare.scm:127:0: source expression failed to match any pattern 
in form (define-syntax-rule if- (not=? arg ...) (compare:if-rel? (-1 1) (0) arg 
make[2]: *** [srfi/srfi-67.go] Error 1
make[2]: Leaving directory 
make[1]: *** [all-recursive] Error 1
make[1]: Leaving directory 
make: *** [all] Error 2
build time elapsed:  0m0.029s 0m0.010s 8m49.070s 0m47.235s
Copying build directory to 
build failed with exit code 2 (ignored)

reply via email to

[Prev in Thread] Current Thread [Next in Thread]