[Top][All Lists]

[Date Prev][Date Next][Thread Prev][Thread Next][Date Index][Thread Index]

[Guile-commits] Hydra job gnu:guile-master:build_without_threads build 1

From: Hydra Build Daemon
Subject: [Guile-commits] Hydra job gnu:guile-master:build_without_threads build 1138291: Failed
Date: Thu, 30 Jun 2011 14:43:09 +0200


This is to let you know that Hydra build 1138291 of job 
gnu:guile-master:build_without_threads has changed from 'Success' to 'Failed'.

Complete build information can be found on this page:

The last 50 lines of the build log are shown at the bottom of this email.

A summary of the build information follows:

Build ID:              | 1138291
Nix name:              | guile-without-threads-
Short description:     | Native Nix build on x86_64-linux
Maintainer(s):         | address@hidden
System:                | x86_64-linux
Derivation store path: | 
Output store path:     | 
Time added:            | 2011-06-30 14:43:09
Build started:         | 2011-06-30 14:21:27
Build finished:        | 2011-06-30 14:43:09
Duration:              | 1302s

The build inputs were:

Name        | Type  | Value
hydraConfig | svn   |
nixpkgs     | svn   |
tarball     | build | 1138247


The Hydra build daemon.

Running poe.test
Running popen.test
Running ports.test
Running posix.test
Running print.test
Running procprop.test
Running procs.test
Running q.test
Running r4rs.test
Running r5rs_pitfall.test
Running r6rs-arithmetic-bitwise.test
Running r6rs-arithmetic-fixnums.test
UNRESOLVED: r6rs-arithmetic-fixnums.test: fx+/carry: simple
UNRESOLVED: r6rs-arithmetic-fixnums.test: fx-/carry: simple
UNRESOLVED: r6rs-arithice-9/psyntax.scm:1355:30: In procedure chi-macro:
ice-9/psyntax.scm:1355:30: Syntax error:
unknown location: source expression failed to match any pattern in form 
((parent-rtd (record-type-descriptor parent-rtd) (record-constructor-descriptor 
parent-rtd)) (fields z))
metic-fixnums.test: fx*/carry: simple
Running r6rs-arithmetic-flonums.test
Running r6rs-base.test
Running r6rs-conditions.test
Running r6rs-control.test
Running r6rs-enums.test
Running r6rs-eval.test
Running r6rs-exceptions.test
Running r6rs-files.test
Running r6rs-hashtables.test
Running r6rs-lists.test
Running r6rs-ports.test
UNRESOLVED: r6rs-ports.test: 7.2.11 Binary Output: put-bytevector [2 args]
UNRESOLVED: r6rs-ports.test: 7.2.11 Binary Output: put-bytevector [3 args]
UNRESOLVED: r6rs-ports.test: 7.2.11 Binary Output: put-bytevector [4 args]
Running r6rs-records-inspection.test
Running r6rs-records-procedural.test
Running r6rs-records-syntactic.test
FAIL: check-guile
1 of 1 test failed
Please report to address@hidden
make[3]: *** [check-TESTS] Error 1
make[3]: Leaving directory 
make[2]: *** [check-am] Error 2
make[2]: Leaving directory 
make[1]: *** [check-recursive] Error 1
make[1]: Leaving directory 
make: *** [check] Error 2
build time elapsed:  0m0.031s 0m0.014s 20m24.655s 0m59.121s
Copying build directory to 
build failed with exit code 2 (ignored)

reply via email to

[Prev in Thread] Current Thread [Next in Thread]