[Top][All Lists]

[Date Prev][Date Next][Thread Prev][Thread Next][Date Index][Thread Index]

[Guile-commits] Hydra job gnu:guile-master:build build 1082852: Failed

From: Hydra Build Daemon
Subject: [Guile-commits] Hydra job gnu:guile-master:build build 1082852: Failed
Date: Fri, 13 May 2011 12:17:37 +0200


This is to let you know that Hydra build 1082852 of job gnu:guile-master:build 
has changed from 'Failed' to 'Failed'.

Complete build information can be found on this page:

The last 50 lines of the build log are shown at the bottom of this email.

A summary of the build information follows:

Build ID:              | 1082852
Nix name:              | guile-2.1.0
Short description:     | Native Nix build on i686-cygwin
Maintainer(s):         | address@hidden
System:                | i686-cygwin
Derivation store path: | 
Output store path:     | /nix/store/0qgaz6a2zl9jnjpiayw828xgvfqqyp4p-guile-2.1.0
Time added:            | 2011-05-13 12:17:36
Build started:         | 2011-05-13 11:52:01
Build finished:        | 2011-05-13 12:17:36
Duration:              | 1535s

The build inputs were:

Name        | Type   | Value
hydraConfig | svn    |
nixpkgs     | svn    |
system      | string | i686-cygwin
tarball     | build  | 1082464


The Hydra build daemon.

make[5]: Nothing to be done for 
make[5]: Nothing to be done for 
make[5]: Nothing to be done for 
make[5]: Nothing to be done for 
make[5]: `test-fast-slot-ref' is up to date.
make[5]: Nothing to be done for 
make[5]: `test-use-srfi' is up to date.
make[5]: Leaving directory 
make  check-TESTS
make[5]: Entering directory 
PASS: test-system-cmds
PASS: test-bad-identifiers
PASS: test-require-extension
PASS: test-guile-snarf
PASS: test-num2integral.exe
PASS: test-round.exe
PASS: test-list.exe
PASS: test-unwind.exe
PASS: test-conversion.exe
PASS: test-loose-ends.exe
PASS: test-fast-slot-ref
PASS: test-mb-regexp
PASS: test-use-srfi
PASS: test-scm-c-read.exe
PASS: test-scm-take-locale-symbol.exe
PASS: test-scm-take-u8vector.exe
PASS: test-with-guile-module.exe
PASS: test-scm-with-guile.exe
FAIL: test-scm-spawn-thread.exe
PASS: test-pthread-create.exe
SKIP: test-pthread-create-secondary.exe
1 of 20 tests failed
(1 test was not run)
Please report to address@hidden
make[5]: *** [check-TESTS] Error 1
make[5]: Leaving directory 
make[4]: *** [check-am] Error 2
make[4]: Leaving directory 
make[3]: *** [check] Error 2
make[3]: Leaving directory 
make[2]: *** [check-recursive] Error 1
make[2]: Leaving directory 
make[1]: *** [check-recursive] Error 1
make[1]: Leaving directory 
make: *** [check] Error 2
build time elapsed:  0m0.062s 0m0.062s 25m4.613s 7m35.702s
Copying build directory to 
build failed with exit code 2 (ignored)

reply via email to

[Prev in Thread] Current Thread [Next in Thread]