[Top][All Lists]

[Date Prev][Date Next][Thread Prev][Thread Next][Date Index][Thread Index]

[Guile-commits] Hydra job gnu:guile-master:build_disable_networking buil

From: Hydra Build Daemon
Subject: [Guile-commits] Hydra job gnu:guile-master:build_disable_networking build 564548: Failed with non-zero exit code
Date: Tue, 17 Aug 2010 01:14:54 +0200


This is to let you know that Hydra build 564548 of job 
gnu:guile-master:build_disable_networking has changed from 'Success' to 'Failed 
with non-zero exit code'.

Complete build information can be found on this page:

The last 50 lines of the build log are shown at the bottom of this email.

A summary of the build information follows:

Build ID:              | 564548
Nix name:              | guile-disable-networking-
Short description:     | Native Nix build on x86_64-linux
Maintainer(s):         | address@hidden
System:                | x86_64-linux
Derivation store path: | 
Output store path:     | 
Time added:            | 2010-08-17 01:14:53
Build started:         | 2010-08-17 00:52:09
Build finished:        | 2010-08-17 01:14:53
Duration:              | 1364s

The build inputs were:

Name        | Type  | Value
hydraConfig | svn   |
nixpkgs     | svn   |
tarball     | build | 562981


The Hydra build daemon.

Running symbols.test
Running syncase.test
Running syntax.test
UNRESOLVED: syntax.test: letrec: bindings: initial bindings are undefined
UNRESOLVED: syntax.test: letrec*: bindings: initial bindings are undefined
Running texinfo.docbook.test
Running texinfo.serialize.test
Running texinfo.string-utils.test
Running texinfo.test
Running threads.test
Running time.test
Running tree-il.test
UNRESOLVED: tree-il.test: warnings: unused-toplevel: used by macro
Running version.test
UNRESOLVED: version.test: version reporting works
Running vlist.test
Running weaks.test

Totals for this test run:
passes:                 12586
failures:               4
unexpected passes:      0
expected failures:      37
unresolved test cases:  1067
untested test cases:    1
unsupported test cases: 9
errors:                 0

Some deprecated features have been used.  Set the environment
variable GUILE_WARN_DEPRECATED to "detailed" and rerun the
program to get more information.  Set it to "no" to suppress
this message.
FAIL: check-guile
1 of 1 test failed
Please report to address@hidden
make[3]: *** [check-TESTS] Error 1
make[3]: Leaving directory 
make[2]: *** [check-am] Error 2
make[2]: Leaving directory 
make[1]: *** [check-recursive] Error 1
make[1]: Leaving directory 
make: *** [check] Error 2
build time elapsed:  0m0.022s 0m0.010s 11m28.384s 0m48.075s
builder for 
 failed with exit code 2
error: build of 
Shared connection to kenny closed.

build of 
 on address@hidden' failed with exit code 256

reply via email to

[Prev in Thread] Current Thread [Next in Thread]