guile-commits
[Top][All Lists]
Advanced

[Date Prev][Date Next][Thread Prev][Thread Next][Date Index][Thread Index]

[Guile-commits] Hydra job gnu:guile-master:build build 390894 FAILED


From: Hydra Build Daemon
Subject: [Guile-commits] Hydra job gnu:guile-master:build build 390894 FAILED
Date: Sun, 2 May 2010 12:32:36 +0200

Hi,

This is to let you know that Hydra build 390894 of job gnu:guile-master:build 
has changed from SUCCEEDED to FAILED.

Complete build information can be found on this page: 
http://hydra.nixos.org/build/390894

The last 50 lines of the build log are shown at the bottom of this email.

A summary of the build information follows:

Build ID:              | 390894
Nix name:              | guile-1.9.10.77
Short description:     | Native Nix build on i686-linux
Maintainer(s):         | address@hidden
System:                | i686-linux
Derivation store path: | 
/nix/store/5881k5abzjabx535wj1a7l793h4hi9mx-guile-1.9.10.77.drv
Output store path:     | 
/nix/store/i9mamj0zryikfjxpnmdsk380d4f15ax5-guile-1.9.10.77
Time added:            | 2010-05-02 12:32:36
Build started:         | 2010-05-02 10:01:10
Build finished:        | 2010-05-02 12:32:36
Duration:              | 9086s

The build inputs were:

Name        | Type   | Value
------------+--------+-------------------------------------------------------------
hydraConfig | svn    | 
https://svn.nixos.org/repos/nix/hydra-config/gnu/trunk:21480
nixpkgs     | svn    | https://svn.nixos.org/repos/nix/nixpkgs/trunk:21550
system      | string | i686-linux
tarball     | build  | 390036

Regards,

The Hydra build daemon.

---
UNRESOLVED: regexp.test: regexp-quote: regexp/extended: (string "aX" 213 #\\xd5 
"a\xd5" "a\xd5")
UNRESOLVED: regexp.test: regexp-quote: regexp/extended: (string "aX" 214 #\\xd6 
"a\xd6" "a\xd6")
UNRESOLVED: regexp.test: regexp-quote: regexp/extended: (string "aX" 215 #\\xd7 
"a\xd7" "a\xd7")
UNRESOLVED: regexp.test: regexp-quote: regexp/extended: (string "aX" 216 #\\xd8 
"a\xd8" "a\xd8")
UNRESOLVED: regexp.test: regexp-quote: regexp/extended: (string "aX" 217 #\\xd9 
"a\xd9" "a\xd9")
UNRESOLVED: regexp.test: regexp-quote: regexp/extended: (string "aX" 218 #\\xda 
"a\xda" "a\xda")
UNRESOLVED: regexp.test: regexp-quote: regexp/extended: (string "aX" 219 #\\xdb 
"a\xdb" "a\xdb")
UNRESOLVED: regexp.test: regexp-quote: regexp/extended: (string "aX" 220 #\\xdc 
"a\xdc" "a\xdc")
UNRESOLVED: regexp.test: regexp-quote: regexp/extended: (string "aX" 221 #\\xdd 
"a\xdd" "a\xdd")
UNRESOLVED: regexp.test: regexp-quote: regexp/extended: (string "aX" 222 #\\xde 
"a\xde" "a\xde")
UNRESOLVED: regexp.test: regexp-quote: regexp/extended: (string "aX" 223 #\\xdf 
"a\xdf" "a\xdf")
UNRESOLVED: regexp.test: regexp-quote: regexp/extended: (string "aX" 224 #\\xe0 
"a\xe0" "a\xe0")
UNRESOLVED: regexp.test: regexp-quote: regexp/extended: (string "aX" 225 #\\xe1 
"a\xe1" "a\xe1")
UNRESOLVED: regexp.test: regexp-quote: regexp/extended: (string "aX" 226 #\\xe2 
"a\xe2" "a\xe2")
UNRESOLVED: regexp.test: regexp-quote: regexp/extended: (string "aX" 227 #\\xe3 
"a\xe3" "a\xe3")
UNRESOLVED: regexp.test: regexp-quote: regexp/extended: (string "aX" 228 #\\xe4 
"a\xe4" "a\xe4")
UNRESOLVED: regexp.test: regexp-quote: regexp/extended: (string "aX" 229 #\\xe5 
"a\xe5" "a\xe5")
UNRESOLVED: regexp.test: regexp-quote: regexp/extended: (string "aX" 230 #\\xe6 
"a\xe6" "a\xe6")
UNRESOLVED: regexp.test: regexp-quote: regexp/extended: (string "aX" 231 #\\xe7 
"a\xe7" "a\xe7")
UNRESOLVED: regexp.test: regexp-quote: regexp/extended: (string "aX" 232 #\\xe8 
"a\xe8" "a\xe8")
UNRESOLVED: regexp.test: regexp-quote: regexp/extended: (string "aX" 233 #\\xe9 
"a\xe9" "a\xe9")
UNRESOLVED: regexp.test: regexp-quote: regexp/extended: (string "aX" 234 #\\xea 
"a\xea" "a\xea")
UNRESOLVED: regexp.test: regexp-quote: regexp/extended: (string "aX" 235 #\\xeb 
"a\xeb" "a\xeb")
UNRESOLVED: regexp.test: regexp-quote: regexp/extended: (string "aX" 236 #\\xec 
"a\xec" "a\xec")
UNRESOLVED: regexp.test: regexp-quote: regexp/extended: (string "aX" 237 #\\xed 
"a\xed" "a\xed")
UNRESOLVED: regexp.test: regexp-quote: regexp/extended: (string "aX" 238 #\\xee 
"a\xee" "a\xee")
UNRESOLVED: regexp.test: regexp-quote: regexp/extended: (string "aX" 239 #\\xef 
"a\xef" "a\xef")
UNRESOLVED: regexp.test: regexp-quote: regexp/extended: (string "aX" 240 #\\xf0 
"a\xf0" "a\xf0")
UNRESOLVED: regexp.test: regexp-quote: regexp/extended: (string "aX" 241 #\\xf1 
"a\xf1" "a\xf1")
UNRESOLVED: regexp.test: regexp-quote: regexp/extended: (string "aX" 242 #\\xf2 
"a\xf2" "a\xf2")
UNRESOLVED: regexp.test: regexp-quote: regexp/extended: (string "aX" 243 #\\xf3 
"a\xf3" "a\xf3")
UNRESOLVED: regexp.test: regexp-quote: regexp/extended: (string "aX" 244 #\\xf4 
"a\xf4" "a\xf4")
UNRESOLVED: regexp.test: regexp-quote: regexp/extended: (string "aX" 245 #\\xf5 
"a\xf5" "a\xf5")
UNRESOLVED: regexp.test: regexp-quote: regexp/extended: (string "aX" 246 #\\xf6 
"a\xf6" "a\xf6")
UNRESOLVED: regexp.test: regexp-quote: regexp/extended: (string "aX" 247 #\\xf7 
"a\xf7" "a\xf7")
UNRESOLVED: regexp.test: regexp-quote: regexp/extended: (string "aX" 248 #\\xf8 
"a\xf8" "a\xf8")
UNRESOLVED: regexp.test: regexp-quote: regexp/extended: (string "aX" 249 #\\xf9 
"a\xf9" "a\xf9")
UNRESOLVED: regexp.test: regexp-quote: regexp/extended: (string "aX" 250 #\\xfa 
"a\xfa" "a\xfa")
UNRESOLVED: regexp.test: regexp-quote: regexp/extended: (string "aX" 251 #\\xfb 
"a\xfb" "a\xfb")
UNRESOLVED: regexp.test: regexp-quote: regexp/extended: (string "aX" 252 #\\xfc 
"a\xfc" "a\xfc")
UNRESOLVED: regexp.test: regexp-quote: regexp/extended: (string "aX" 253 #\\xfd 
"a\xfd" "a\xfd")
UNRESOLVED: regexp.test: regexp-quote: regexp/extended: (string "aX" 254 #\\xfe 
"a\xfe" "a\xfe")
UNRESOLVED: regexp.test: regexp-quote: regexp/extended: (string "aX" 255 #\\xff 
"a\xff" "a\xff")
UNRESOLVED: regexp.test: regexp-quote: regexp/extended: string of all chars
Running signals.test
Running socket.test
building of `/nix/store/5881k5abzjabx535wj1a7l793h4hi9mx-guile-1.9.10.77.drv' 
timed out after 3600 seconds of silence
error: build of 
`/nix/store/5881k5abzjabx535wj1a7l793h4hi9mx-guile-1.9.10.77.drv' failed
Shared connection to kenny closed.

build of `/nix/store/5881k5abzjabx535wj1a7l793h4hi9mx-guile-1.9.10.77.drv' on 
address@hidden' failed with exit code 256




reply via email to

[Prev in Thread] Current Thread [Next in Thread]