[Top][All Lists]

[Date Prev][Date Next][Thread Prev][Thread Next][Date Index][Thread Index]

[Guile-commits] Hydra job gnu:guile-master:manual build 389887 FAILED

From: Hydra Build Daemon
Subject: [Guile-commits] Hydra job gnu:guile-master:manual build 389887 FAILED
Date: Sat, 1 May 2010 07:17:50 +0200


This is to let you know that Hydra build 389887 of job gnu:guile-master:manual 
has changed from FAILED to FAILED.

Complete build information can be found on this page:

The last 50 lines of the build log are shown at the bottom of this email.

A summary of the build information follows:

Build ID:              | 389887
Nix name:              | guile-manual-
Short description:     | Native Nix build on x86_64-linux
Maintainer(s):         | address@hidden
System:                | x86_64-linux
Derivation store path: | 
Output store path:     | 
Time added:            | 2010-05-01 07:17:50
Build started:         | 2010-05-01 07:09:18
Build finished:        | 2010-05-01 07:17:50
Duration:              | 512s

The build inputs were:

Name        | Type  | Value
hydraConfig | svn   |
nixpkgs     | svn   |
tarball     | build | 389594


The Hydra build daemon.

config.status: creating meta/Makefile
config.status: creating module/Makefile
config.status: creating testsuite/Makefile
config.status: creating meta/guile-2.0.pc
config.status: creating meta/guile-2.0-uninstalled.pc
config.status: creating check-guile
config.status: creating benchmark-guile
config.status: creating meta/guile
config.status: creating meta/uninstalled-env
config.status: creating meta/gdb-uninstalled-guile
config.status: creating meta/guile-tools
config.status: creating libguile/guile-snarf
config.status: creating libguile/guile-doc-snarf
config.status: creating libguile/guile-func-name-check
config.status: creating libguile/guile-snarf-docs
config.status: creating test-suite/standalone/test-use-srfi
config.status: creating test-suite/standalone/test-fast-slot-ref
config.status: creating doc/ref/effective-version.texi
config.status: creating config.h
config.status: executing depfiles commands
config.status: executing libtool commands
config.status: executing po-directories commands
make: Entering directory 
building guile.html
rm -rf guile.htp
if /bin/sh 
 --run makeinfo --html   -I . \
         -o guile.htp guile.texi; \
        then \
          rm -rf guile.html; \
          if test ! -d guile.htp && test -d guile; then \
            mv guile guile.html; else mv guile.htp guile.html; fi; \
        else \
          if test ! -d guile.htp && test -d guile; then \
            rm -rf guile; else rm -Rf guile.htp guile.html; fi; \
          exit 1; \
guile.texi:209: @include `tour.texi': No such file or directory.
 Prev reference to nonexistent node `Hello Guile!' (perhaps incorrect 
 Next reference to nonexistent node `Hello Guile!' (perhaps incorrect 
 Cross reference to nonexistent node `Putting Extensions into Modules' (perhaps 
incorrect sectioning?).
 Menu reference to nonexistent node `Hello Guile!' (perhaps incorrect 
makeinfo: Removing output file 
 due to errors; use --force to preserve.
make: *** [guile.html] Error 1
make: Leaving directory 
build time elapsed:  0m0.017s 0m0.008s 0m33.440s 0m19.306s
builder for 
`/nix/store/lr5b1f2q9qg4hd1l520jraq8sw6kfdn3-guile-manual-' failed 
with exit code 2
error: build of 
`/nix/store/lr5b1f2q9qg4hd1l520jraq8sw6kfdn3-guile-manual-' failed
Shared connection to kyle closed.

build of 
`/nix/store/lr5b1f2q9qg4hd1l520jraq8sw6kfdn3-guile-manual-' on 
address@hidden' failed with exit code 256

reply via email to

[Prev in Thread] Current Thread [Next in Thread]