[Top][All Lists]

[Date Prev][Date Next][Thread Prev][Thread Next][Date Index][Thread Index]

[Guile-commits] Hydra job gnu:guile-master:tarball build 274811 FAILED

From: Hydra Build Daemon
Subject: [Guile-commits] Hydra job gnu:guile-master:tarball build 274811 FAILED
Date: Thu, 28 Jan 2010 21:53:54 +0100


This is to let you know that Hydra build274811 of job gnu:guile-master:tarball 
has changed from SUCCEEDED to FAILED.

Complete build information can be found on this page:

The last 50 lines of the build log are shown at the bottom of this email.

A summary of the build information follows:

Build ID:              | 274811
Nix name:              | 
Short description:     | Build of a source distribution from a checkout
Maintainer(s):         | address@hidden
System:                | x86_64-linux
Derivation store path: | 
Output store path:     | 
Time added:            | 2010-01-28 21:53:54
Build started:         | 2010-01-28 21:52:29
Build finished:        | 2010-01-28 21:53:54
Duration:              | 85s

The build inputs were:

Name        | Type | Value
hydraConfig | svn  |
nixpkgs     | svn  |
guileSrc    | git  | 


The Hydra build daemon.

checking for utimensat... yes

checking crypt.h usability... yes

checking crypt.h presence... yes

checking for crypt.h... yes

checking netdb.h usability... yes

checking netdb.h presence... yes

checking for netdb.h... yes

checking pthread.h usability... yes

checking pthread.h presence... yes

checking for pthread.h... yes

checking for sys/param.h... (cached) yes

checking sys/resource.h usability... yes

checking sys/resource.h presence... yes

checking for sys/resource.h... yes

checking for sys/file.h... (cached) yes

checking for chroot... yes

checking for flock... (cached) yes

checking for getlogin... yes

checking for cuserid... yes

checking for getpriority... yes

checking for setpriority... yes

checking for getpass... yes

checking for sethostname... yes

checking for gethostname... yes

checking whether sethostname is declared... yes

checking whether hstrerror is declared... no

checking whether cuserid is declared... yes

checking for library containing crypt... -lcrypt

checking for i... _Complex_I

checking whether csqrt is usable... yes

checking for libgmp... yes

checking how to link with libgmp... -lgmp

checking for pkg-config... 

checking pkg-config is at least version 0.9.0... yes

checking for LIBFFI... configure: error: Package requirements (libffi) were not 

No package 'libffi' found

Consider adjusting the PKG_CONFIG_PATH environment variable if you

installed software in a non-standard prefix.

Alternatively, you may set the environment variables LIBFFI_CFLAGS

and LIBFFI_LIBS to avoid the need to call pkg-config.

See the pkg-config man page for more details.

build time elapsed:  0m0.024s 0m0.008s 0m42.586s 0m15.950s

builder for 
 failed with exit code 1

error: build of 

Connection to kyle closed.

build of 
 on address@hidden' failed with exit code 256

reply via email to

[Prev in Thread] Current Thread [Next in Thread]