[Top][All Lists]

[Date Prev][Date Next][Thread Prev][Thread Next][Date Index][Thread Index]

[Guile-commits] Hydra job gnu:guile-master:build_without_threads build 2

From: Hydra Build Daemon
Subject: [Guile-commits] Hydra job gnu:guile-master:build_without_threads build 255972 FAILED
Date: Sat, 23 Jan 2010 18:15:24 +0100


This is to let you know that Hydra build255972 of job 
gnu:guile-master:build_without_threads has changed from SUCCEEDED to FAILED.

Complete build information can be found on this page:

The last 50 lines of the build log are shown at the bottom of this email.

A summary of the build information follows:

Build ID:              | 255972
Nix name:              | guile-without-threads-git
Short description:     | Native Nix build on i686-linux
Maintainer(s):         | address@hidden
System:                | i686-linux
Derivation store path: | 
Output store path:     | 
Time added:            | 2010-01-23 18:15:24
Build started:         | 2010-01-23 17:59:53
Build finished:        | 2010-01-23 18:15:24
Duration:              | 931s

The build inputs were:

Name        | Type   | Value
hydraConfig | svn    |
nixpkgs     | svn    |
system      | string | i686-linux
tarball     | build  | 255953


The Hydra build daemon.

Running statprof.test

UNRESOLVED: statprof.test: accurate call counting

Running strings.test

Running structs.test

Running sxml.fold.test

Running sxml.ssax.test

Running sxml.transform.test

Running sxml.xpath.test

Running symbols.test

Running syncase.test

Running syntax.test

UNRESOLVED: syntax.test: letrec: bindings: initial bindings are undefined

Running texinfo.docbook.test

Running texinfo.serialize.test

Running texinfo.string-utils.test

Running texinfo.test

Running threads.test

Running time.test

Running tree-il.test

UNRESOLVED: tree-il.test: warnings: unused-toplevel: used by macro

Running unif.test

Running version.test

UNRESOLVED: version.test: version reporting works

Running weaks.test

Totals for this test run:

passes:                 12898

failures:               1

unexpected passes:      0

expected failures:      37

unresolved test cases:  33

untested test cases:    1

unsupported test cases: 15

errors:                 0

FAIL: check-guile


1 of 1 test failed

Please report to address@hidden


make[2]: *** [check-TESTS] Error 1

make[2]: Leaving directory 

make[1]: *** [check-am] Error 2

make[1]: Leaving directory 

make: *** [check-recursive] Error 1

build time elapsed:  0m0.022s 0m0.006s 14m27.917s 0m41.158s

builder for 
failed with exit code 2

error: build of 

Connection to kenny closed.

build of 
`/nix/store/8xbvvx08z686jdkly87l3824c00dn2lk-guile-without-threads-git.drv' on 
address@hidden' failed with exit code 256

reply via email to

[Prev in Thread] Current Thread [Next in Thread]