[Top][All Lists]

[Date Prev][Date Next][Thread Prev][Thread Next][Date Index][Thread Index]

[Guile-commits] Hydra job gnu:guile-master:build build 254620 FAILED

From: Hydra Build Daemon
Subject: [Guile-commits] Hydra job gnu:guile-master:build build 254620 FAILED
Date: Thu, 21 Jan 2010 22:32:49 +0100


This is to let you know that Hydra build254620 of job gnu:guile-master:build 
has changed from SUCCEEDED to FAILED.

Complete build information can be found on this page:

The last 50 lines of the build log are shown at the bottom of this email.

A summary of the build information follows:

Build ID:              | 254620
Nix name:              | guile-git
Short description:     | Native Nix build on i686-darwin
Maintainer(s):         | address@hidden
System:                | i686-darwin
Derivation store path: | 
Output store path:     | /nix/store/lh22dfq7264yf1brjd20lc0c3yb2pjj2-guile-git
Time added:            | 2010-01-21 22:32:48
Build started:         | 2010-01-21 22:31:08
Build finished:        | 2010-01-21 22:32:48
Duration:              | 100s

The build inputs were:

Name        | Type   | Value
hydraConfig | svn    |
nixpkgs     | svn    |
system      | string | i686-darwin
tarball     | build  | 249862


The Hydra build daemon.

        mv t-ref-add.sed ref-add.sed

building ref-del.sed

rm -f t-ref-del.sed ref-del.sed && \

        sed -e '/^#/d' -e 's/@''PACKAGE''@/guile/g' ref-del.sin > t-ref-del.sed 
&& \

        mv t-ref-del.sed ref-del.sed

make[4]: Leaving directory 

make[3]: Leaving directory 

make[2]: Leaving directory 

Making all in meta

make[2]: Entering directory 

building guile-config

guile | /nix/store/yhqnyfm2bdy7mxvz3jd4kd9im5jmjm64-gnused-4.1.5/bin/sed -e 
's,x,x,'`" ;  \

        cat ./                                                   

        | /nix/store/yhqnyfm2bdy7mxvz3jd4kd9im5jmjm64-gnused-4.1.5/bin/sed -e 
 ;                 \

 ;                            \


        > guile-config.out

mv guile-config.out guile-config

chmod +x guile-config

make[2]: Leaving directory 

Making all in libguile

make[2]: Entering directory 

building libpath.h

Generating libpath.h...

building version.h

sed < ./ > version.h.tmp \

          -e s:@-GUILE_MAJOR_VERSION-@:1: \

          -e s:@-GUILE_MINOR_VERSION-@:9: \

          -e s:@-GUILE_MICRO_VERSION-@:7:

mv version.h.tmp version.h

building gen-scmconfig.o

if [ "no" = "yes" ]; then \

                gcc -std=gnu99 -DHAVE_CONFIG_H  -DBUILDING_LIBGUILE=1 -I.. -I.. 
-I../lib -I../lib -c -o gen-scmconfig.o gen-scmconfig.c; \

        else \

                gcc -std=gnu99 -DHAVE_CONFIG_H   -DBUILDING_LIBGUILE=1 -I.. 
-I.. -I../lib -I../lib  -Wall -Wmissing-prototypes 
-Wdeclaration-after-statement -Wundef -Wswitch-enum -Werror -fvisibility=hidden 
-I/nix/store/vcmi9sl7hl6ic76dff8pq8w2xgwgbplx-boehm-gc-7.1/include   -g -O2 -c 
-o gen-scmconfig.o gen-scmconfig.c; \


In file included from 


                 from gen-scmconfig.c:128:

 error: "__GLIBC__" is not defined

make[2]: *** [gen-scmconfig.o] Error 1

make[2]: Leaving directory 

make[1]: *** [all-recursive] Error 1

make[1]: Leaving directory 

make: *** [all] Error 2

build time elapsed:  0m0.039s 0m0.021s 0m37.032s 0m37.568s

builder for `/nix/store/78rlallq05iby3pyv9ngzxd8kxbsgdwn-guile-git.drv' failed 
with exit code 2

error: build of `/nix/store/78rlallq05iby3pyv9ngzxd8kxbsgdwn-guile-git.drv' 

Connection to black closed.

build of `/nix/store/78rlallq05iby3pyv9ngzxd8kxbsgdwn-guile-git.drv' on 
address@hidden' failed with exit code 256

reply via email to

[Prev in Thread] Current Thread [Next in Thread]