[Top][All Lists]

[Date Prev][Date Next][Thread Prev][Thread Next][Date Index][Thread Index]

Re: [Gnash] Re: gnash cvs compilation error

From: Bastiaan Jacques
Subject: Re: [Gnash] Re: gnash cvs compilation error
Date: Thu, 29 Mar 2007 22:52:27 +0200 (CEST)

On Thu, 29 Mar 2007, Deanna Phillips wrote:

button_character_instance.cpp: In function `void
button_character_instance.cpp:226: error: invalid conversion from `void
  (*)(const gnash::fn_call&)' to `gnash::as_value (*)(const gnash::fn_call&)'
button_character_instance.cpp:226: error:   initializing argument 1 of `
  gnash::builtin_function::builtin_function(gnash::as_value (*)(const
  gnash::fn_call&), gnash::as_object*)'
button_character_instance.cpp: At global scope:
button_character_instance.cpp:282: error: prototype for `gnash::as_value
  gnash::button_character_instance::enabled_getset(const gnash::fn_call&)'
  does not match any in class `gnash::button_character_instance'
button_character_instance.h:130: error: candidate is: static void
  gnash::button_character_instance::enabled_getset(const gnash::fn_call&)
button_character_instance.cpp:282: error: `gnash::as_value
  gnash::button_character_instance::enabled_getset(const gnash::fn_call&)' and
  `static void gnash::button_character_instance::enabled_getset(const
  gnash::fn_call&)' cannot be overloaded
gmake[3]: *** [button_character_instance.lo] Error 1

Are you sure your CVS checkout is clean? My checkout, for instance, has a declaration of enabled_getset on line 130 of button_character_instance.h which does not return void.


reply via email to

[Prev in Thread] Current Thread [Next in Thread]