[Top][All Lists]

[Date Prev][Date Next][Thread Prev][Thread Next][Date Index][Thread Index]

[Gnash] gnash cvs compilation error

From: പ്രവീ ണ്‍‌| Praveen എ|A
Subject: [Gnash] gnash cvs compilation error
Date: Wed, 7 Feb 2007 17:54:56 +0530


I have been able to compile gnash from cvs successfully some days
back and it plays most of the flash content on web but when I did a
cvs update the compilation is failing now.

The error message is given below.

NetConnection.h:89: error: ISO C++ forbids declaration of 'CURL' with no type
NetConnection.h:89: error: expected ';' before '*' token
NetConnection.h:92: error: ISO C++ forbids declaration of 'CURLM' with no type
NetConnection.h:92: error: expected ';' before '*' token
make[3]: *** [Global.lo] Error 1
make[3]: Leaving directory `/home/pravi/forge/cvs/gnash/server/asobj'
make[2]: *** [all-recursive] Error 1
make[2]: Leaving directory `/home/pravi/forge/cvs/gnash/server'
make[1]: *** [all-recursive] Error 1
make[1]: Leaving directory `/home/pravi/forge/cvs/gnash'
make: *** [all] Error 2


Join The DRM Elimination Crew Now!

reply via email to

[Prev in Thread] Current Thread [Next in Thread]