[Top][All Lists]

[Date Prev][Date Next][Thread Prev][Thread Next][Date Index][Thread Index]

[Flexisip-developers] /src/flexisip/tester/tester.hh:22:30: fatal error:

From: Brian J. Murrell
Subject: [Flexisip-developers] /src/flexisip/tester/tester.hh:22:30: fatal error: bctoolbox/tester.h: No such file or directory
Date: Mon, 29 Jul 2019 10:16:10 -0400
User-agent: Evolution 3.32.3 (3.32.3-1.fc30)

I've installed bc-sofia-sip-devel, bc-belr-devel, bc-ortp-devel, bc-
mediastreamer-devel, and bc-bctoolbox-devel from 
http://www.linphone.org/snapshots/centos7/ and then tried to build
flexisip with:

$ cmake . -DCMAKE_INSTALL_PREFIX=/opt/belledonne-communications 
$ make

It ends up failing at:

$ make
[  0%] Built target flexisip-git-version
[ 90%] Built target flexisip
[ 91%] Linking CXX executable flexisip
[ 92%] Built target flexisip_server
Scanning dependencies of target flexisip_pusher
[ 93%] Building CXX object src/CMakeFiles/flexisip_pusher.dir/tools/pusher.cc.o
[ 94%] Linking CXX executable flexisip_pusher
[ 94%] Built target flexisip_pusher
Scanning dependencies of target flexisip_serializer
[ 95%] Building CXX object 
[ 96%] Linking CXX executable flexisip_serializer
[ 96%] Built target flexisip_serializer
Scanning dependencies of target flexisip_tester
[ 97%] Building CXX object tester/CMakeFiles/flexisip_tester.dir/tester.cc.o
In file included from /src/flexisip/tester/tester.cc:19:0:
/src/flexisip/tester/tester.hh:22:30: fatal error: bctoolbox/tester.h: No such 
file or directory
 #include "bctoolbox/tester.h"
compilation terminated.
make[2]: *** [tester/CMakeFiles/flexisip_tester.dir/tester.cc.o] Error 1
make[1]: *** [tester/CMakeFiles/flexisip_tester.dir/all] Error 2
make: *** [all] Error 2

Any ideas?


Attachment: signature.asc
Description: This is a digitally signed message part

reply via email to

[Prev in Thread] Current Thread [Next in Thread]