[Top][All Lists]

[Date Prev][Date Next][Thread Prev][Thread Next][Date Index][Thread Index]

Compileing gnustep-gui-0.8.5

From: Liam Whalen
Subject: Compileing gnustep-gui-0.8.5
Date: Sun, 6 Jul 2003 23:01:57 -0400 (EDT)

I gave up on using the new code and went back to the version's specified
in http://documents.made-it.com/GNUstep/Build/

Now I get this error when building gnustep-gui-0.8.5

Making all for service example...
./shared_obj/ix86/linux-gnu/gnu-gnu-gnu/make_services: error while loading
shared libraries:
undefined symbol: __vacall_r
make[2]: *** [example.service/Resources/Info-gnustep.plist] Error 1
make[1]: *** [example.all.service.variables] Error 2
make[1]: Leaving directory
make: *** [internal-all] Error 2

It looks like I've done something wrong when I compiled gnustep-base-1.6.0
I'm not sure what that is though.
Any ideas?


reply via email to

[Prev in Thread] Current Thread [Next in Thread]