[Top][All Lists]

[Date Prev][Date Next][Thread Prev][Thread Next][Date Index][Thread Index]

Compile problem with gui snapshot

From: Jeff Sciortino
Subject: Compile problem with gui snapshot
Date: Sat, 21 Apr 2001 22:32:26 -0400

I'm trying to compile the core snapshot of 4-21 

make compiles and installs fine, base doesn't come back with errors, but gui 
gives me this error when making:

Making all for svc example...
./shared_obj/ix86/linux-gnu/gnu-gnu-gnu/make_services: error while loading 
shared libraries: libgnustep-base.so.1: cannot load shared object file: No 
such file or directory
make[3]: *** [example.service/Resources/Info-gnustep.plist] Error 1
make[2]: *** [example.build] Error 2
make[1]: *** [example.all.svc.variables] Error 2
make[1]: Leaving directory `/home/jjs/GNUstep/Downloads/core/gui/Tools'
make: *** [internal-all] Error 2

Any  ideas?



reply via email to

[Prev in Thread] Current Thread [Next in Thread]