[Top][All Lists]

[Date Prev][Date Next][Thread Prev][Thread Next][Date Index][Thread Index]

[Dazuko-devel] Re: openSuSE 11.1 - status report

From: jim burns
Subject: [Dazuko-devel] Re: openSuSE 11.1 - status report
Date: Sat, 3 Jan 2009 09:29:07 -0500
User-agent: KMail/1.10.3 (Linux/; KDE/4.1.3; i686; ; )

On Sat January 3 2009 1:20:11 am you wrote:
> With those changes, the patch applies. Now I need to do the 3
> hour recompile of the kernel to see if it does anything meaningful, and
> will report back later.

No joy. The kernel compile with the openSuSE 11 patch to add 2.3.5 dazuko 
functionality ended as below. Do you need any other info to get dazukofs or 
dazuko to compile for openSuSE 11.1? (Until antivir comes out with a dazukofs 
version, getting dazuko to compile is more important.) Thanx.

  GEN     security/apparmor/capability_names.h                                  
  GEN     security/apparmor/af_names.h                                          
  CC      security/apparmor/main.o                                              
  CC      security/apparmor/list.o                                              
  CC      security/apparmor/procattr.o                                          
  CC      security/apparmor/lsm.o                                               
  CC      security/apparmor/apparmorfs.o                                        
  CC      security/apparmor/module_interface.o                                  
security/apparmor/module_interface.c: In function ‘aa_is_nameX’:                
security/apparmor/module_interface.c:129: warning: ‘tag’ may be used 
uninitialized in this function                                                  
security/apparmor/module_interface.c: In function ‘aa_is_dynstring’:            
security/apparmor/module_interface.c:234: warning: ‘src_str’ may be used 
uninitialized in this function
  CC      security/apparmor/match.o
  LD      security/apparmor/apparmor.o
  LD      security/apparmor/built-in.o
  CC      security/dazuko/hooks.o
security/dazuko/hooks.c: In function ‘dazuko_inode_permission’:
security/dazuko/hooks.c:47: error: too many arguments to function 
security/dazuko/hooks.c: In function ‘dazuko_ptrace’:
security/dazuko/hooks.c:52: error: ‘struct security_operations’ has no member 
named ‘ptrace’
security/dazuko/hooks.c: At top level:
security/dazuko/hooks.c:199: error: unknown field ‘register_security’ 
specifiedin initializer
security/dazuko/hooks.c:199: warning: missing braces around initializer
security/dazuko/hooks.c:199: warning: (near initialization for 
security/dazuko/hooks.c:199: warning: initialization makes integer from 
pointerwithout a cast
security/dazuko/hooks.c:199: error: initializer element is not computable at 
load time
security/dazuko/hooks.c:199: error: (near initialization for 
security/dazuko/hooks.c:200: warning: initialization from incompatible pointer 
security/dazuko/hooks.c:202: error: unknown field ‘ptrace’ specified in 
security/dazuko/hooks.c:202: warning: initialization from incompatible pointer 
security/dazuko/hooks.c:215: warning: initialization from incompatible pointer 
security/dazuko/hooks.c:216: warning: initialization from incompatible pointer 
security/dazuko/hooks.c: In function ‘dazuko_register’:
security/dazuko/hooks.c:240: error: implicit declaration of function 
make[2]: *** [security/dazuko/hooks.o] Error 1
make[1]: *** [security/dazuko] Error 2
make: *** [security] Error 2
error: Bad exit status from /var/tmp/rpm-tmp.1529 (%build)

RPM build errors:
    Bad exit status from /var/tmp/rpm-tmp.1529 (%build)

reply via email to

[Prev in Thread] Current Thread [Next in Thread]