[Top][All Lists]

[Date Prev][Date Next][Thread Prev][Thread Next][Date Index][Thread Index]

[bug-mdk] [bug #41097] ar: no archive members specified

From: Joel Heikkila
Subject: [bug-mdk] [bug #41097] ar: no archive members specified
Date: Sun, 18 May 2014 20:37:32 +0000
User-agent: Mozilla/5.0 (Macintosh; Intel Mac OS X 10_9_1) AppleWebKit/537.36 (KHTML, like Gecko) Chrome/34.0.1847.131 Safari/537.36

Follow-up Comment #2, bug #41097 (project mdk):

Hi.  I'm attempting to build current git head on OS X 10.9.  I can confirm
that the archive problem no longer occurs (it occurred when I downloaded 1.2.7
and attempted to build it, Google search of the error led me here).  

Unfortunately there's also a compiler error later in the build:

gcc -DHAVE_CONFIG_H -I. -I..   -I/usr/local/include -Wall -fno-strict-aliasing
-D_THREAD_SAFE -I/usr/local/Cellar/guile/2.0.11/include/guile/2.0
-I/usr/local/opt/gettext/include  -DG_DISABLE_DEPRECATED -I/usr/local/include
-I.. -DMAKE_GUILE  -g -O2 -MT mixvm_command.o -MD -MP -MF
.deps/mixvm_command.Tpo -c -o mixvm_command.o mixvm_command.c
mixvm_command.c:83:20: error: use of undeclared identifier 'Function'
  { (char *)NULL, (Function *)NULL, (char *)NULL }
mixvm_command.c:83:30: error: expected expression
  { (char *)NULL, (Function *)NULL, (char *)NULL }
mixvm_command.c:220:39: error: use of undeclared identifier 'CPPFunction'
  rl_attempted_completion_function = (CPPFunction *)mixvm_cmd_completion_;
mixvm_command.c:220:52: error: expected expression
  rl_attempted_completion_function = (CPPFunction *)mixvm_cmd_completion_;
4 errors generated.
make[2]: *** [mixvm_command.o] Error 1
make[1]: *** [all-recursive] Error 1
make: *** [all] Error 2


Reply to this item at:


  Message sent via/by Savannah

reply via email to

[Prev in Thread] Current Thread [Next in Thread]