[Top][All Lists]

[Date Prev][Date Next][Thread Prev][Thread Next][Date Index][Thread Index]

Re: [bug-mailutils] problem with build 20151028 git snapshot

From: Sergey
Subject: Re: [bug-mailutils] problem with build 20151028 git snapshot
Date: Sun, 8 Nov 2015 15:15:11 +0400
User-agent: KMail/1.9.10 (enterprise35 0.20100827.1168748)

On Saturday 07 November 2015, Sergey wrote:

> /usr/bin/ld: shell.o: undefined reference to symbol 'mu_set_signals'
> /home/b/RPM/BUILD/mailutils/lib/.libs/libmuaux.so.4: error adding symbols: 
> DSO missing from command line
> collect2: error: ld returned 1 exit status

I sent some details about libmuaux.so to your private mail.

Another problem. This is happens when I attempt to build mu
with guile library by gcc 5.2 (and not happens by 4.7; only
gcc version is switched):

cat mu_address.doc mu_body.doc mu_debug.doc mu_mailbox.doc mu_message.doc 
mu_mime.doc mu_logger.doc mu_port.doc mu_scm.doc mu_util.doc  | \
         /usr/bin/guile-tools snarf-check-and-output-texi > 
ERROR: unknown doc attribute: (cname (hash . hash) (id . 
scm_mu_address_get_personal) (hash . hash))
make[2]: *** [guile-procedures.texi] Error 1


reply via email to

[Prev in Thread] Current Thread [Next in Thread]