[Top][All Lists]

[Date Prev][Date Next][Thread Prev][Thread Next][Date Index][Thread Index]

Re: [bug-mailutils] Make on OSX fails

From: Henrik Frisk
Subject: Re: [bug-mailutils] Make on OSX fails
Date: Mon, 20 Mar 2006 10:00:10 +0100

When trying to build GNU Mailutils 0.6.90 on OSX make fails with the
following output:

../intl/libintl.a(localcharset.o) definition of _locale_charset in
section (__TEXT,__text)

Try reconfiguring the package with --disable-nls option.

Thanks for the reply!

Got a little further. Now the error is:

libtool: link: warning: `/usr/lib/gcc/powerpc-apple- darwin8/4.0.0/../../..//libiconv.la' seems to be moved libtool: link: warning: `/usr/lib/gcc/powerpc-apple- darwin8/4.0.0/../../..//libltdl.la' seems to be moved gcc -o .libs/timestamp.so -bundle .libs/timestamp.o - all_load ../../lib/.libs/libmailutils.a ../../mailbox/.libs/ libmailbox.dylib /usr/lib/gcc/powerpc-apple-darwin8/4.0.0/../../..// libiconv.dylib /usr/lib/gcc/powerpc-apple-darwin8/4.0.0/../../..// libresolv.dylib /usr/lib/gcc/powerpc-apple-darwin8/4.0.0/../../..// libpthread.dylib ../.libs/libsieve.dylib /usr/lib/gcc/powerpc-apple- darwin8/4.0.0/../../..//libltdl.3.1.0.dylib /usr/lib/gcc/powerpc- apple-darwin8/4.0.0/../../..//libdl.dylib -lresolv -lpthread
/usr/bin/ld: Undefined symbols:
collect2: ld returned 1 exit status
make[4]: *** [timestamp.la] Error 1
make[3]: *** [all-recursive] Error 1
make[2]: *** [all] Error 2
make[1]: *** [all-recursive] Error 1
make: *** [all] Error 2

reply via email to

[Prev in Thread] Current Thread [Next in Thread]