[Top][All Lists]

[Date Prev][Date Next][Thread Prev][Thread Next][Date Index][Thread Index]

also in C11 mode I get a bug

From: Dennis Clarke
Subject: also in C11 mode I get a bug
Date: Mon, 13 Sep 2021 00:44:23 -0400
User-agent: Mozilla/5.0 (X11; Linux x86_64; rv:92.0) Gecko/20100101 Thunderbird/92.0

With std9899:2011 we compile fine but testsuite fails :

Checking ./stackovf.test
Stack soft limit set to 300K

Skipped checks were:
  ./125.changeword ./126.changeword ./127.changeword ./128.changeword
./129.changeword ./130.changeword
Failed checks were:
gmake[3]: *** [Makefile:2065: check-local] Error 1
gmake[3]: Leaving directory
gmake[2]: *** [Makefile:1941: check-am] Error 2
gmake[2]: Leaving directory
gmake[1]: *** [Makefile:2018: check-recursive] Error 1
gmake[1]: Leaving directory '/opt/bw/build/m4-1.4.19_sunos5.10_sparcv9.002'
gmake: *** [Makefile:2317: check] Error 2

Not sure what to make of that.

Dennis Clarke
UNIX and Linux spoken
GreyBeard and suspenders optional

reply via email to

[Prev in Thread] Current Thread [Next in Thread]