[Top][All Lists]

[Date Prev][Date Next][Thread Prev][Thread Next][Date Index][Thread Index]

[Bug-gsl] Error during installation

From: Ravindra Singh
Subject: [Bug-gsl] Error during installation
Date: Tue, 14 May 2019 20:25:38 +0530

Dear Sir/Madam

When i tried to "make" for gsl 1.16 in ubuntu 18.04, one error is showing--

./.libs/libgslsiman.a(siman.o): In function `boltzmann':
/home/ravi/Downloads/gsl-1.16/siman/siman.c:38: undefined reference to `exp'
/home/ravi/Downloads/gsl-1.16/siman/siman.c:38: undefined reference to `exp'
/home/ravi/Downloads/gsl-1.16/siman/siman.c:38: undefined reference to `exp'
collect2: error: ld returned 1 exit status
Makefile:604: recipe for target 'siman_tsp' failed
make[2]: *** [siman_tsp] Error 1
make[2]: Leaving directory '/home/ravi/Downloads/gsl-1.16/siman'
Makefile:955: recipe for target 'all-recursive' failed
make[1]: *** [all-recursive] Error 1
make[1]: Leaving directory '/home/ravi/Downloads/gsl-1.16'
Makefile:657: recipe for target 'all' failed

What should I do?

Thank You
With Regards
Ravindra Singh
(Ph.D scholar IITI)

Attachment: Screenshot from 2019-05-14 20-24-22.png
Description: PNG image

reply via email to

[Prev in Thread] Current Thread [Next in Thread]