[Top][All Lists]

[Date Prev][Date Next][Thread Prev][Thread Next][Date Index][Thread Index]

GRUB tests failed

From: Anthony Smith
Subject: GRUB tests failed
Date: Wed, 11 May 2005 02:35:39 -0500
User-agent: Mozilla Thunderbird 1.0.2 (Windows/20050317)

When I emerge GRUB in a new Gentoo installation I get this error:

make[3]: *** [check-TESTS] Error 1
make[3]: Leaving directory `blahblahblah`
make[2]: *** [check-am] Error 2
make[2]: Leaving directory `blahblahblah`
make[1]: *** [check] Error 2
make[1]: Leaving directory `blahblahblah`
make: *** [check-recursive] Error 1

I get this before hand:

>>Test phase [enabled]: sys-boot/grub-0.94-r1
>>Test phase [check]: sys-boot/grub-0.94-r1
Making check in netboot
make[1]: Entering directory `blahblahblah/netboot`
make[1]: Nothing to be done for `check`
make[1]: Leaving directory `blahblahblah/netboot`
Making check in stage2
make[1]: Entering directory `blahblahblah/stage2`
make check-am
make[2]: Entering directory `blahblahblah/stage2`
make check-TESTS
make[3]: Entering directory `blahblahblah/stage2`
ffs_stage1_5 is too big (9248 > 7168)
FAIL: size_test

reply via email to

[Prev in Thread] Current Thread [Next in Thread]