[Top][All Lists]

[Date Prev][Date Next][Thread Prev][Thread Next][Date Index][Thread Index]

[GnuCOBOL 3.1.2] testsuite: 783 796 failed

From: DHCarter
Subject: [GnuCOBOL 3.1.2] testsuite: 783 796 failed
Date: Wed, 29 Mar 2023 15:43:22 -0400
User-agent: Mozilla/5.0 (Windows NT 10.0; Win64; x64; rv:102.0) Gecko/20100101 Thunderbird/102.9.0

You may investigate any problem if you feel able to do so, in which
case the test suite provides a good starting point.  Its output may
be found below `tests/testsuite.dir'.

make[3]: *** [Makefile:788: check-local] Error 1
make[3]: Leaving directory '/cygdrive/c/gnucobol/gnucobol-3.1.2_win/tests'
make[2]: *** [Makefile:665: check-am] Error 2
make[2]: Leaving directory '/cygdrive/c/gnucobol/gnucobol-3.1.2_win/tests'
make[1]: *** [Makefile:513: check-recursive] Error 1
make[1]: Leaving directory '/cygdrive/c/gnucobol/gnucobol-3.1.2_win/tests'
make: *** [Makefile:626: check-recursive] Error 1

Please see the attached.



Attachment: testsuite.log
Description: Text document

Attachment: testsuite_0783.log
Description: Text document

Attachment: testsuite_0796.log
Description: Text document

reply via email to

[Prev in Thread] Current Thread [Next in Thread]