[Top][All Lists]

[Date Prev][Date Next][Thread Prev][Thread Next][Date Index][Thread Index]

[Bug-gnubg] bug gnubg will not compile

From: ya6hd4
Subject: [Bug-gnubg] bug gnubg will not compile
Date: Sun, 30 Aug 2015 19:38:28 +0200

I tried to compile under windows the latest course (25-8-215)
and got the errors
c:\mingw\bin\../lib/gcc/mingw32/4.5.2/../../../../include/winnt.h:3095:4: error:
expected identifier or '(' before numeric constant
c:\mingw\bin\../lib/gcc/mingw32/4.5.2/../../../../include/winnt.h:3096:2: error:
expected ';' before 'DWORD'
make[2]: *** [dice.o] Error 1
make[2]: Leaving directory `/home/Scorpioos2/build/gnubg'
make[1]: *** [all-recursive] Error 1
make[1]: Leaving directory `/home/Scorpioos2/build/gnubg'
make: *** [all] Error 2

reply via email to

[Prev in Thread] Current Thread [Next in Thread]