bug-gnu-pspp
[Top][All Lists]
Advanced

[Date Prev][Date Next][Thread Prev][Thread Next][Date Index][Thread Index]

AW: PSPP-BUG: bug report


From: Cordes, Andreas
Subject: AW: PSPP-BUG: bug report
Date: Mon, 31 Mar 2008 16:20:59 +0200

Hi John, Hi Jason,
thank you for your replies, I ll try the alpha then.
best
andreas


-----Urspr√ľngliche Nachricht-----
Von: John Darrington [mailto:address@hidden
Gesendet: Sa 29.03.2008 00:16
An: Cordes, Andreas
Cc: address@hidden
Betreff: Re: PSPP-BUG: bug report
 
You would appear to be using a 64 bit machine.  Unfortunately, 0.4.0.x
does not work on 64 bit machines.

If you try the latest alpha version at ftp://alpha.gnu.org/gnu/pspp I
think you will have better results.

Or wait for the next release; real soon now!

J'



On Thu, Mar 27, 2008 at 06:21:19PM +0100, Andreas Cordes wrote:
     Hi,
     i encountered several errors when checking the result of make. Find
attached 
     the report of make check.
     
     Does anyone know what i can do to make pspp run?
     I am working under suse 10.3 linux.
     Best
     Andreas
     -- 
     _________________________________________________
     
     Dipl.- Psych Andreas Cordes
     Ambulanz f??r Familientherapie
     Abteilung Psychosomatik und Psychotherapie
     Universit??t G??ttingen
     Humboldallee 38
     37073 G??ttingen
     
     tel: +49 551 39 5469
     fax: +49 551 39 5467
     address@hidden
     _________________________________________________

     
     address@hidden:~/Software/PSPP/pspp-0.4.0.1> make check
     Making check in m4
     make[1]: Entering directory
`/home/andreas/Software/PSPP/pspp-0.4.0.1/m4'
     make[1]: F??r das Ziel ??check?? ist nichts zu tun.
     make[1]: Leaving directory `/home/andreas/Software/PSPP/pspp-0.4.0.1/m4'
     Making check in intl
     make[1]: Entering directory
`/home/andreas/Software/PSPP/pspp-0.4.0.1/intl'
     make[1]: F??r das Ziel ??check?? ist nichts zu tun.
     make[1]: Leaving directory
`/home/andreas/Software/PSPP/pspp-0.4.0.1/intl'
     Making check in doc
     make[1]: Entering directory
`/home/andreas/Software/PSPP/pspp-0.4.0.1/doc'
     make[1]: F??r das Ziel ??check?? ist nichts zu tun.
     make[1]: Leaving directory
`/home/andreas/Software/PSPP/pspp-0.4.0.1/doc'
     Making check in lib
     make[1]: Entering directory
`/home/andreas/Software/PSPP/pspp-0.4.0.1/lib'
     Making check in gsl-extras
     make[2]: Entering directory
`/home/andreas/Software/PSPP/pspp-0.4.0.1/lib/gsl-extras'
     make[2]: F??r das Ziel ??check?? ist nichts zu tun.
     make[2]: Leaving directory
`/home/andreas/Software/PSPP/pspp-0.4.0.1/lib/gsl-extras'
     make[2]: Entering directory
`/home/andreas/Software/PSPP/pspp-0.4.0.1/lib'
     make[2]: F??r das Ziel ??check-am?? ist nichts zu tun.
     make[2]: Leaving directory
`/home/andreas/Software/PSPP/pspp-0.4.0.1/lib'
     make[1]: Leaving directory
`/home/andreas/Software/PSPP/pspp-0.4.0.1/lib'
     Making check in gl
     make[1]: Entering directory
`/home/andreas/Software/PSPP/pspp-0.4.0.1/gl'
     make  check-am
     make[2]: Entering directory
`/home/andreas/Software/PSPP/pspp-0.4.0.1/gl'
     make[2]: F??r das Ziel ??check-am?? ist nichts zu tun.
     make[2]: Leaving directory `/home/andreas/Software/PSPP/pspp-0.4.0.1/gl'
     make[1]: Leaving directory `/home/andreas/Software/PSPP/pspp-0.4.0.1/gl'
     Making check in src
     make[1]: Entering directory
`/home/andreas/Software/PSPP/pspp-0.4.0.1/src'
     Making check in expressions
     make[2]: Entering directory
`/home/andreas/Software/PSPP/pspp-0.4.0.1/src/expressions'
     make  check-am
     make[3]: Entering directory
`/home/andreas/Software/PSPP/pspp-0.4.0.1/src/expressions'
     make[3]: F??r das Ziel ??check-am?? ist nichts zu tun.
     make[3]: Leaving directory
`/home/andreas/Software/PSPP/pspp-0.4.0.1/src/expressions'
     make[2]: Leaving directory
`/home/andreas/Software/PSPP/pspp-0.4.0.1/src/expressions'
     make[2]: Entering directory
`/home/andreas/Software/PSPP/pspp-0.4.0.1/src'
     make[2]: F??r das Ziel ??check-am?? ist nichts zu tun.
     make[2]: Leaving directory
`/home/andreas/Software/PSPP/pspp-0.4.0.1/src'
     make[1]: Leaving directory
`/home/andreas/Software/PSPP/pspp-0.4.0.1/src'
     Making check in po
     make[1]: Entering directory
`/home/andreas/Software/PSPP/pspp-0.4.0.1/po'
     make[1]: F??r das Ziel ??check?? ist nichts zu tun.
     make[1]: Leaving directory `/home/andreas/Software/PSPP/pspp-0.4.0.1/po'
     Making check in config
     make[1]: Entering directory
`/home/andreas/Software/PSPP/pspp-0.4.0.1/config'
     make[1]: F??r das Ziel ??check?? ist nichts zu tun.
     make[1]: Leaving directory
`/home/andreas/Software/PSPP/pspp-0.4.0.1/config'
     Making check in tests
     make[1]: Entering directory
`/home/andreas/Software/PSPP/pspp-0.4.0.1/tests'
     make  check-TESTS
     make[2]: Entering directory
`/home/andreas/Software/PSPP/pspp-0.4.0.1/tests'
     ./command/aggregate.sh: line 171:  2598 Abgebrochen
$SUPERVISOR $here/../src/pspp --testing-mode -o raw-ascii $name.pspp >
/dev/null 2>&1
     run active-presorted-itemwise.pspp
     NO RESULT
     FAIL: command/aggregate.sh
     ******************************************************************
     You have discovered a bug in PSPP.
     
       Please report this, by sending an email to address@hidden,
     explaining what you were doing when this happened, and including
     a sample of your input file which caused it.
     Also, please copy the following lines into your bug report:
     
     bare_version:        0.4.0.1
     version:             GNU pspp 0.4.0.1
     stat_version:        GNU pspp 0.4.0.1 (Do 27. M??r 18:01:30 CET 2008).
     host_system:         x86_64-unknown-linux-gnu
     build_system:        x86_64-unknown-linux-gnu
     default_config_path: ~/.pspp:/usr/local/etc/pspp
     include_path:        ./:~/.pspp/include:/usr/local/share/pspp
     groff_font_path:
~/.pspp/font:/usr/local/share/pspp/font:/usr/local/lib/groff/font:/usr/lib/gr
off/font:/usr/local/share/groff/font:/usr/share/groff/font
     locale_dir:          /usr/local/share/locale
     compiler version:    4.2.1 (SUSE Linux)
     Diagnosis: Segmentation Violation
     ******************************************************************
     ./command/autorecod.sh: line 80:  2610 Abgebrochen
$SUPERVISOR $here/../src/pspp -o raw-ascii $TESTFILE
     run program
     NO RESULT
     FAIL: command/autorecod.sh
     ******************************************************************
     You have discovered a bug in PSPP.
     
       Please report this, by sending an email to address@hidden,
     explaining what you were doing when this happened, and including
     a sample of your input file which caused it.
     Also, please copy the following lines into your bug report:
     
     bare_version:        0.4.0.1
     version:             GNU pspp 0.4.0.1
     stat_version:        GNU pspp 0.4.0.1 (Do 27. M??r 18:01:30 CET 2008).
     host_system:         x86_64-unknown-linux-gnu
     build_system:        x86_64-unknown-linux-gnu
     default_config_path: ~/.pspp:/usr/local/etc/pspp
     include_path:        ./:~/.pspp/include:/usr/local/share/pspp
     groff_font_path:
~/.pspp/font:/usr/local/share/pspp/font:/usr/local/lib/groff/font:/usr/lib/gr
off/font:/usr/local/share/groff/font:/usr/share/groff/font
     locale_dir:          /usr/local/share/locale
     compiler version:    4.2.1 (SUSE Linux)
     Diagnosis: Segmentation Violation
     ******************************************************************
     ./command/beg-data.sh: line 79:  2623 Abgebrochen
$SUPERVISOR $here/../src/pspp -o raw-ascii $TESTFILE
     run program
     NO RESULT
     FAIL: command/beg-data.sh
     ******************************************************************
     You have discovered a bug in PSPP.
     
       Please report this, by sending an email to address@hidden,
     explaining what you were doing when this happened, and including
     a sample of your input file which caused it.
     Also, please copy the following lines into your bug report:
     
     bare_version:        0.4.0.1
     version:             GNU pspp 0.4.0.1
     stat_version:        GNU pspp 0.4.0.1 (Do 27. M??r 18:01:30 CET 2008).
     host_system:         x86_64-unknown-linux-gnu
     build_system:        x86_64-unknown-linux-gnu
     default_config_path: ~/.pspp:/usr/local/etc/pspp
     include_path:        ./:~/.pspp/include:/usr/local/share/pspp
     groff_font_path:
~/.pspp/font:/usr/local/share/pspp/font:/usr/local/lib/groff/font:/usr/lib/gr
off/font:/usr/local/share/groff/font:/usr/share/groff/font
     locale_dir:          /usr/local/share/locale
     compiler version:    4.2.1 (SUSE Linux)
     Diagnosis: Segmentation Violation
     ******************************************************************
     ./command/bignum.sh: line 133:  2638 Abgebrochen             $SUPERVISOR
$here/../src/pspp -o raw-ascii $TESTFILE
     run program
     NO RESULT
     FAIL: command/bignum.sh
     ******************************************************************
     You have discovered a bug in PSPP.
     
       Please report this, by sending an email to address@hidden,
     explaining what you were doing when this happened, and including
     a sample of your input file which caused it.
     Also, please copy the following lines into your bug report:
     
     bare_version:        0.4.0.1
     version:             GNU pspp 0.4.0.1
     stat_version:        GNU pspp 0.4.0.1 (Do 27. M??r 18:01:30 CET 2008).
     host_system:         x86_64-unknown-linux-gnu
     build_system:        x86_64-unknown-linux-gnu
     default_config_path: ~/.pspp:/usr/local/etc/pspp
     include_path:        ./:~/.pspp/include:/usr/local/share/pspp
     groff_font_path:
~/.pspp/font:/usr/local/share/pspp/font:/usr/local/lib/groff/font:/usr/lib/gr
off/font:/usr/local/share/groff/font:/usr/share/groff/font
     locale_dir:          /usr/local/share/locale
     compiler version:    4.2.1 (SUSE Linux)
     Diagnosis: Segmentation Violation
     ******************************************************************
     ./command/count.sh: line 71:  2651 Abgebrochen             $SUPERVISOR
$here/../src/pspp -o raw-ascii $TESTFILE
     
     NO RESULT
     FAIL: command/count.sh
     ******************************************************************
     You have discovered a bug in PSPP.
     
       Please report this, by sending an email to address@hidden,
     explaining what you were doing when this happened, and including
     a sample of your input file which caused it.
     Also, please copy the following lines into your bug report:
     
     bare_version:        0.4.0.1
     version:             GNU pspp 0.4.0.1
     stat_version:        GNU pspp 0.4.0.1 (Do 27. M??r 18:01:30 CET 2008).
     host_system:         x86_64-unknown-linux-gnu
     build_system:        x86_64-unknown-linux-gnu
     default_config_path: ~/.pspp:/usr/local/etc/pspp
     include_path:        ./:~/.pspp/include:/usr/local/share/pspp
     groff_font_path:
~/.pspp/font:/usr/local/share/pspp/font:/usr/local/lib/groff/font:/usr/lib/gr
off/font:/usr/local/share/groff/font:/usr/share/groff/font
     locale_dir:          /usr/local/share/locale
     compiler version:    4.2.1 (SUSE Linux)
     Diagnosis: Segmentation Violation
     ******************************************************************
     ./command/data-list.sh: line 105:  2664 Abgebrochen
$SUPERVISOR $here/../src/pspp --testing-mode -o raw-ascii --testing-mode
$TESTFILE
     run program
     FAILED
     FAIL: command/data-list.sh
     PASS: command/erase.sh
     ******************************************************************
     You have discovered a bug in PSPP.
     
       Please report this, by sending an email to address@hidden,
     explaining what you were doing when this happened, and including
     a sample of your input file which caused it.
     Also, please copy the following lines into your bug report:
     
     bare_version:        0.4.0.1
     version:             GNU pspp 0.4.0.1
     stat_version:        GNU pspp 0.4.0.1 (Do 27. M??r 18:01:30 CET 2008).
     host_system:         x86_64-unknown-linux-gnu
     build_system:        x86_64-unknown-linux-gnu
     default_config_path: ~/.pspp:/usr/local/etc/pspp
     include_path:        ./:~/.pspp/include:/usr/local/share/pspp
     groff_font_path:
~/.pspp/font:/usr/local/share/pspp/font:/usr/local/lib/groff/font:/usr/lib/gr
off/font:/usr/local/share/groff/font:/usr/share/groff/font
     locale_dir:          /usr/local/share/locale
     compiler version:    4.2.1 (SUSE Linux)
     Diagnosis: Segmentation Violation
     ******************************************************************
     ./command/examine.sh: line 91:  2689 Abgebrochen             $SUPERVISOR
$here/../src/pspp -o raw-ascii $TESTFILE
     run program
     NO RESULT
     FAIL: command/examine.sh
     PASS: command/examine-extremes.sh
     PASS: command/examine-percentiles.sh
     PASS: command/file-label.sh
     ******************************************************************
     You have discovered a bug in PSPP.
     
       Please report this, by sending an email to address@hidden,
     explaining what you were doing when this happened, and including
     a sample of your input file which caused it.
     Also, please copy the following lines into your bug report:
     
     bare_version:        0.4.0.1
     version:             GNU pspp 0.4.0.1
     stat_version:        GNU pspp 0.4.0.1 (Do 27. M??r 18:01:30 CET 2008).
     host_system:         x86_64-unknown-linux-gnu
     build_system:        x86_64-unknown-linux-gnu
     default_config_path: ~/.pspp:/usr/local/etc/pspp
     include_path:        ./:~/.pspp/include:/usr/local/share/pspp
     groff_font_path:
~/.pspp/font:/usr/local/share/pspp/font:/usr/local/lib/groff/font:/usr/lib/gr
off/font:/usr/local/share/groff/font:/usr/share/groff/font
     locale_dir:          /usr/local/share/locale
     compiler version:    4.2.1 (SUSE Linux)
     Diagnosis: Segmentation Violation
     ******************************************************************
     ./command/filter.sh: line 81:  2737 Abgebrochen             $SUPERVISOR
$here/../src/pspp --testing-mode -o raw-ascii $TESTFILE
     run program
     NO RESULT
     FAIL: command/filter.sh
     ******************************************************************
     You have discovered a bug in PSPP.
     
       Please report this, by sending an email to address@hidden,
     explaining what you were doing when this happened, and including
     a sample of your input file which caused it.
     Also, please copy the following lines into your bug report:
     
     bare_version:        0.4.0.1
     version:             GNU pspp 0.4.0.1
     stat_version:        GNU pspp 0.4.0.1 (Do 27. M??r 18:01:30 CET 2008).
     host_system:         x86_64-unknown-linux-gnu
     build_system:        x86_64-unknown-linux-gnu
     default_config_path: ~/.pspp:/usr/local/etc/pspp
     include_path:        ./:~/.pspp/include:/usr/local/share/pspp
     groff_font_path:
~/.pspp/font:/usr/local/share/pspp/font:/usr/local/lib/groff/font:/usr/lib/gr
off/font:/usr/local/share/groff/font:/usr/share/groff/font
     locale_dir:          /usr/local/share/locale
     compiler version:    4.2.1 (SUSE Linux)
     Diagnosis: Segmentation Violation
     ******************************************************************
     ./command/flip.sh: line 71:  2809 Abgebrochen             $SUPERVISOR
$here/../src/pspp -o raw-ascii $TEMPDIR/flip.stat
     run program
     NO RESULT
     FAIL: command/flip.sh
     ******************************************************************
     You have discovered a bug in PSPP.
     
       Please report this, by sending an email to address@hidden,
     explaining what you were doing when this happened, and including
     a sample of your input file which caused it.
     Also, please copy the following lines into your bug report:
     
     bare_version:        0.4.0.1
     version:             GNU pspp 0.4.0.1
     stat_version:        GNU pspp 0.4.0.1 (Do 27. M??r 18:01:30 CET 2008).
     host_system:         x86_64-unknown-linux-gnu
     build_system:        x86_64-unknown-linux-gnu
     default_config_path: ~/.pspp:/usr/local/etc/pspp
     include_path:        ./:~/.pspp/include:/usr/local/share/pspp
     groff_font_path:
~/.pspp/font:/usr/local/share/pspp/font:/usr/local/lib/groff/font:/usr/lib/gr
off/font:/usr/local/share/groff/font:/usr/share/groff/font
     locale_dir:          /usr/local/share/locale
     compiler version:    4.2.1 (SUSE Linux)
     Diagnosis: Segmentation Violation
     ******************************************************************
     ./command/import-export.sh: line 72:  2822 Abgebrochen
$SUPERVISOR $here/../src/pspp --testing-mode -o raw-ascii $TESTFILE
     run program
     NO RESULT
     FAIL: command/import-export.sh
     ******************************************************************
     You have discovered a bug in PSPP.
     
       Please report this, by sending an email to address@hidden,
     explaining what you were doing when this happened, and including
     a sample of your input file which caused it.
     Also, please copy the following lines into your bug report:
     
     bare_version:        0.4.0.1
     version:             GNU pspp 0.4.0.1
     stat_version:        GNU pspp 0.4.0.1 (Do 27. M??r 18:01:30 CET 2008).
     host_system:         x86_64-unknown-linux-gnu
     build_system:        x86_64-unknown-linux-gnu
     default_config_path: ~/.pspp:/usr/local/etc/pspp
     include_path:        ./:~/.pspp/include:/usr/local/share/pspp
     groff_font_path:
~/.pspp/font:/usr/local/share/pspp/font:/usr/local/lib/groff/font:/usr/lib/gr
off/font:/usr/local/share/groff/font:/usr/share/groff/font
     locale_dir:          /usr/local/share/locale
     compiler version:    4.2.1 (SUSE Linux)
     Diagnosis: Segmentation Violation
     ******************************************************************
     ./command/lag.sh: line 70:  2834 Abgebrochen             $SUPERVISOR
$here/../src/pspp -o raw-ascii $TEMPDIR/lag.stat
     run program
     NO RESULT
     FAIL: command/lag.sh
     ******************************************************************
     You have discovered a bug in PSPP.
     
       Please report this, by sending an email to address@hidden,
     explaining what you were doing when this happened, and including
     a sample of your input file which caused it.
     Also, please copy the following lines into your bug report:
     
     bare_version:        0.4.0.1
     version:             GNU pspp 0.4.0.1
     stat_version:        GNU pspp 0.4.0.1 (Do 27. M??r 18:01:30 CET 2008).
     host_system:         x86_64-unknown-linux-gnu
     build_system:        x86_64-unknown-linux-gnu
     default_config_path: ~/.pspp:/usr/local/etc/pspp
     include_path:        ./:~/.pspp/include:/usr/local/share/pspp
     groff_font_path:
~/.pspp/font:/usr/local/share/pspp/font:/usr/local/lib/groff/font:/usr/lib/gr
off/font:/usr/local/share/groff/font:/usr/share/groff/font
     locale_dir:          /usr/local/share/locale
     compiler version:    4.2.1 (SUSE Linux)
     Diagnosis: Segmentation Violation
     ******************************************************************
     ./command/list.sh: line 71:  2846 Abgebrochen             $SUPERVISOR
$here/../src/pspp --testing-mode -o raw-ascii $TESTFILE
     run program
     NO RESULT
     FAIL: command/list.sh
     PASS: command/loop.sh
     ******************************************************************
     You have discovered a bug in PSPP.
     
       Please report this, by sending an email to address@hidden,
     explaining what you were doing when this happened, and including
     a sample of your input file which caused it.
     Also, please copy the following lines into your bug report:
     
     bare_version:        0.4.0.1
     version:             GNU pspp 0.4.0.1
     stat_version:        GNU pspp 0.4.0.1 (Do 27. M??r 18:01:30 CET 2008).
     host_system:         x86_64-unknown-linux-gnu
     build_system:        x86_64-unknown-linux-gnu
     default_config_path: ~/.pspp:/usr/local/etc/pspp
     include_path:        ./:~/.pspp/include:/usr/local/share/pspp
     groff_font_path:
~/.pspp/font:/usr/local/share/pspp/font:/usr/local/lib/groff/font:/usr/lib/gr
off/font:/usr/local/share/groff/font:/usr/share/groff/font
     locale_dir:          /usr/local/share/locale
     compiler version:    4.2.1 (SUSE Linux)
     Diagnosis: Segmentation Violation
     ******************************************************************
     ./command/longvars.sh: line 70:  2871 Abgebrochen
$SUPERVISOR $here/../src/pspp -o raw-ascii $TESTFILE
     run program
     NO RESULT
     FAIL: command/longvars.sh
     ./command/match-files.sh: line 129:  2886 Abgebrochen
$SUPERVISOR $here/../src/pspp -o raw-ascii $name.pspp > /dev/null 2>&1
     run ff-ss.pspp
     NO RESULT
     FAIL: command/match-files.sh
     ******************************************************************
     You have discovered a bug in PSPP.
     
       Please report this, by sending an email to address@hidden,
     explaining what you were doing when this happened, and including
     a sample of your input file which caused it.
     Also, please copy the following lines into your bug report:
     
     bare_version:        0.4.0.1
     version:             GNU pspp 0.4.0.1
     stat_version:        GNU pspp 0.4.0.1 (Do 27. M??r 18:01:30 CET 2008).
     host_system:         x86_64-unknown-linux-gnu
     build_system:        x86_64-unknown-linux-gnu
     default_config_path: ~/.pspp:/usr/local/etc/pspp
     include_path:        ./:~/.pspp/include:/usr/local/share/pspp
     groff_font_path:
~/.pspp/font:/usr/local/share/pspp/font:/usr/local/lib/groff/font:/usr/lib/gr
off/font:/usr/local/share/groff/font:/usr/share/groff/font
     locale_dir:          /usr/local/share/locale
     compiler version:    4.2.1 (SUSE Linux)
     Diagnosis: Segmentation Violation
     ******************************************************************
     ./command/no_case_size.sh: line 67:  2898 Abgebrochen
$SUPERVISOR $here/../src/pspp --testing-mode -o raw-ascii $TESTFILE
     run program
     NO RESULT
     FAIL: command/no_case_size.sh
     PASS: command/oneway.sh
     PASS: command/oneway-missing.sh
     PASS: command/oneway-with-splits.sh
     PASS: command/permissions.sh
     ******************************************************************
     You have discovered a bug in PSPP.
     
       Please report this, by sending an email to address@hidden,
     explaining what you were doing when this happened, and including
     a sample of your input file which caused it.
     Also, please copy the following lines into your bug report:
     
     bare_version:        0.4.0.1
     version:             GNU pspp 0.4.0.1
     stat_version:        GNU pspp 0.4.0.1 (Do 27. M??r 18:01:30 CET 2008).
     host_system:         x86_64-unknown-linux-gnu
     build_system:        x86_64-unknown-linux-gnu
     default_config_path: ~/.pspp:/usr/local/etc/pspp
     include_path:        ./:~/.pspp/include:/usr/local/share/pspp
     groff_font_path:
~/.pspp/font:/usr/local/share/pspp/font:/usr/local/lib/groff/font:/usr/lib/gr
off/font:/usr/local/share/groff/font:/usr/share/groff/font
     locale_dir:          /usr/local/share/locale
     compiler version:    4.2.1 (SUSE Linux)
     Diagnosis: Segmentation Violation
     ******************************************************************
     ./command/print.sh: line 76:  2971 Abgebrochen             $SUPERVISOR
$here/../src/pspp --testing-mode -o raw-ascii --testing-mode
$TEMPDIR/print.stat > $TEMPDIR/errs
     0a1,14
     > /tmp/pspp-tst-2964/data-list.data:1: error: (columns 1-5, field type
F8.0) Field does not form a valid floating-point constant.
     > /tmp/pspp-tst-2964/data-list.data:1: warning: LIST: The expression on
PRINT SPACE evaluated to the system-missing value.
     > /tmp/pspp-tst-2964/data-list.data:2: error: (columns 1-8, field type
F8.0) Field does not form a valid floating-point constant.
     > /tmp/pspp-tst-2964/data-list.data:4: warning: LIST: The expression on
PRINT SPACE evaluated to the system-missing value.
     > /tmp/pspp-tst-2964/data-list.data:4: error: (columns 3-12, field type
F8.0) Field does not form a valid floating-point constant.
     > /tmp/pspp-tst-2964/data-list.data:6: warning: LIST: The expression on
PRINT SPACE evaluated to the system-missing value.
     > /tmp/pspp-tst-2964/data-list.data:1: error: (columns 1-5, field type
F8.0) Field does not form a valid floating-point constant.
     > /tmp/pspp-tst-2964/data-list.data:2: error: (columns 1-8, field type
F8.0) Field does not form a valid floating-point constant.
     > /tmp/pspp-tst-2964/data-list.data:2: warning: LIST: Missing value(s)
for all variables from C onward.  These will be filled with the
system-missing value or blanks, as appropriate.
     > /tmp/pspp-tst-2964/data-list.data:3: warning: LIST: Missing value(s)
for all variables from B onward.  These will be filled with the
system-missing value or blanks, as appropriate.
     > /tmp/pspp-tst-2964/data-list.data:4: error: (columns 3-12, field type
F8.0) Field does not form a valid floating-point constant.
     > /tmp/pspp-tst-2964/data-list.data:4: warning: LIST: Missing value(s)
for all variables from C onward.  These will be filled with the
system-missing value or blanks, as appropriate.
     > /tmp/pspp-tst-2964/data-list.data:5: warning: LIST: Missing value(s)
for all variables from C onward.  These will be filled with the
system-missing value or blanks, as appropriate.
     > /tmp/pspp-tst-2964/data-list.data:6: warning: LIST: Missing value(s)
for all variables from B onward.  These will be filled with the
system-missing value or blanks, as appropriate.
     compare error messages
     FAILED
     FAIL: command/print.sh
     ******************************************************************
     You have discovered a bug in PSPP.
     
       Please report this, by sending an email to address@hidden,
     explaining what you were doing when this happened, and including
     a sample of your input file which caused it.
     Also, please copy the following lines into your bug report:
     
     bare_version:        0.4.0.1
     version:             GNU pspp 0.4.0.1
     stat_version:        GNU pspp 0.4.0.1 (Do 27. M??r 18:01:30 CET 2008).
     host_system:         x86_64-unknown-linux-gnu
     build_system:        x86_64-unknown-linux-gnu
     default_config_path: ~/.pspp:/usr/local/etc/pspp
     include_path:        ./:~/.pspp/include:/usr/local/share/pspp
     groff_font_path:
~/.pspp/font:/usr/local/share/pspp/font:/usr/local/lib/groff/font:/usr/lib/gr
off/font:/usr/local/share/groff/font:/usr/share/groff/font
     locale_dir:          /usr/local/share/locale
     compiler version:    4.2.1 (SUSE Linux)
     Diagnosis: Segmentation Violation
     ******************************************************************
     ./command/rename.sh: line 73:  2984 Abgebrochen             $SUPERVISOR
$here/../src/pspp -o raw-ascii $TESTFILE
     run program
     NO RESULT
     FAIL: command/rename.sh
     ******************************************************************
     You have discovered a bug in PSPP.
     
       Please report this, by sending an email to address@hidden,
     explaining what you were doing when this happened, and including
     a sample of your input file which caused it.
     Also, please copy the following lines into your bug report:
     
     bare_version:        0.4.0.1
     version:             GNU pspp 0.4.0.1
     stat_version:        GNU pspp 0.4.0.1 (Do 27. M??r 18:01:30 CET 2008).
     host_system:         x86_64-unknown-linux-gnu
     build_system:        x86_64-unknown-linux-gnu
     default_config_path: ~/.pspp:/usr/local/etc/pspp
     include_path:        ./:~/.pspp/include:/usr/local/share/pspp
     groff_font_path:
~/.pspp/font:/usr/local/share/pspp/font:/usr/local/lib/groff/font:/usr/lib/gr
off/font:/usr/local/share/groff/font:/usr/share/groff/font
     locale_dir:          /usr/local/share/locale
     compiler version:    4.2.1 (SUSE Linux)
     Diagnosis: Segmentation Violation
     ******************************************************************
     ./command/sample.sh: line 76:  2996 Abgebrochen             $SUPERVISOR
$here/../src/pspp -o raw-ascii --testing-mode $TEMPDIR/sample.stat
     run program
     NO RESULT
     FAIL: command/sample.sh
     ....................
     PASS: command/sort.sh
     ******************************************************************
     You have discovered a bug in PSPP.
     
       Please report this, by sending an email to address@hidden,
     explaining what you were doing when this happened, and including
     a sample of your input file which caused it.
     Also, please copy the following lines into your bug report:
     
     bare_version:        0.4.0.1
     version:             GNU pspp 0.4.0.1
     stat_version:        GNU pspp 0.4.0.1 (Do 27. M??r 18:01:30 CET 2008).
     host_system:         x86_64-unknown-linux-gnu
     build_system:        x86_64-unknown-linux-gnu
     default_config_path: ~/.pspp:/usr/local/etc/pspp
     include_path:        ./:~/.pspp/include:/usr/local/share/pspp
     groff_font_path:
~/.pspp/font:/usr/local/share/pspp/font:/usr/local/lib/groff/font:/usr/lib/gr
off/font:/usr/local/share/groff/font:/usr/share/groff/font
     locale_dir:          /usr/local/share/locale
     compiler version:    4.2.1 (SUSE Linux)
     Diagnosis: Segmentation Violation
     ******************************************************************
     ./command/sysfiles.sh: line 78:  3102 Abgebrochen
$SUPERVISOR $here/../src/pspp -o raw-ascii $TESTFILE
     run program
     NO RESULT
     FAIL: command/sysfiles.sh
     ******************************************************************
     You have discovered a bug in PSPP.
     
       Please report this, by sending an email to address@hidden,
     explaining what you were doing when this happened, and including
     a sample of your input file which caused it.
     Also, please copy the following lines into your bug report:
     
     bare_version:        0.4.0.1
     version:             GNU pspp 0.4.0.1
     stat_version:        GNU pspp 0.4.0.1 (Do 27. M??r 18:01:30 CET 2008).
     host_system:         x86_64-unknown-linux-gnu
     build_system:        x86_64-unknown-linux-gnu
     default_config_path: ~/.pspp:/usr/local/etc/pspp
     include_path:        ./:~/.pspp/include:/usr/local/share/pspp
     groff_font_path:
~/.pspp/font:/usr/local/share/pspp/font:/usr/local/lib/groff/font:/usr/lib/gr
off/font:/usr/local/share/groff/font:/usr/share/groff/font
     locale_dir:          /usr/local/share/locale
     compiler version:    4.2.1 (SUSE Linux)
     Diagnosis: Segmentation Violation
     ******************************************************************
     ./command/sysfiles-old.sh: line 79:  3116 Abgebrochen
$SUPERVISOR $here/../src/pspp -o raw-ascii $TESTFILE
     run program
     NO RESULT
     FAIL: command/sysfiles-old.sh
     PASS: command/sysfile-info.sh
     ******************************************************************
     You have discovered a bug in PSPP.
     
       Please report this, by sending an email to address@hidden,
     explaining what you were doing when this happened, and including
     a sample of your input file which caused it.
     Also, please copy the following lines into your bug report:
     
     bare_version:        0.4.0.1
     version:             GNU pspp 0.4.0.1
     stat_version:        GNU pspp 0.4.0.1 (Do 27. M??r 18:01:30 CET 2008).
     host_system:         x86_64-unknown-linux-gnu
     build_system:        x86_64-unknown-linux-gnu
     default_config_path: ~/.pspp:/usr/local/etc/pspp
     include_path:        ./:~/.pspp/include:/usr/local/share/pspp
     groff_font_path:
~/.pspp/font:/usr/local/share/pspp/font:/usr/local/lib/groff/font:/usr/lib/gr
off/font:/usr/local/share/groff/font:/usr/share/groff/font
     locale_dir:          /usr/local/share/locale
     compiler version:    4.2.1 (SUSE Linux)
     Diagnosis: Segmentation Violation
     ******************************************************************
     ./command/split-file.sh: line 77:  3142 Abgebrochen
$SUPERVISOR $here/../src/pspp -o raw-ascii $TEMPDIR/split.stat
     run program
     NO RESULT
     FAIL: command/split-file.sh
     PASS: command/t-test-1-indep-val.sh
     PASS: command/t-test-1-sample-missing-anal.sh
     PASS: command/t-test-1-sample-missing-list.sh
     PASS: command/t-test-1s.sh
     PASS: command/t-test-groups.sh
     PASS: command/t-test-indep-missing-anal.sh
     PASS: command/t-test-indep-missing-list.sh
     PASS: command/t-test-paired-missing-anal.sh
     PASS: command/t-test-paired-missing-list.sh
     PASS: command/t-test-pairs.sh
     PASS: command/trimmed-mean.sh
     PASS: command/tabs.sh
     ******************************************************************
     You have discovered a bug in PSPP.
     
       Please report this, by sending an email to address@hidden,
     explaining what you were doing when this happened, and including
     a sample of your input file which caused it.
     Also, please copy the following lines into your bug report:
     
     bare_version:        0.4.0.1
     version:             GNU pspp 0.4.0.1
     stat_version:        GNU pspp 0.4.0.1 (Do 27. M??r 18:01:30 CET 2008).
     host_system:         x86_64-unknown-linux-gnu
     build_system:        x86_64-unknown-linux-gnu
     default_config_path: ~/.pspp:/usr/local/etc/pspp
     include_path:        ./:~/.pspp/include:/usr/local/share/pspp
     groff_font_path:
~/.pspp/font:/usr/local/share/pspp/font:/usr/local/lib/groff/font:/usr/lib/gr
off/font:/usr/local/share/groff/font:/usr/share/groff/font
     locale_dir:          /usr/local/share/locale
     compiler version:    4.2.1 (SUSE Linux)
     Diagnosis: Segmentation Violation
     ******************************************************************
     ./command/use.sh: line 74:  3322 Abgebrochen             $SUPERVISOR
$here/../src/pspp --testing-mode -o raw-ascii $TEMPDIR/filter.stat
     run program
     NO RESULT
     FAIL: command/use.sh
     PASS: command/weight.sh
     ******************************************************************
     You have discovered a bug in PSPP.
     
       Please report this, by sending an email to address@hidden,
     explaining what you were doing when this happened, and including
     a sample of your input file which caused it.
     Also, please copy the following lines into your bug report:
     
     bare_version:        0.4.0.1
     version:             GNU pspp 0.4.0.1
     stat_version:        GNU pspp 0.4.0.1 (Do 27. M??r 18:01:30 CET 2008).
     host_system:         x86_64-unknown-linux-gnu
     build_system:        x86_64-unknown-linux-gnu
     default_config_path: ~/.pspp:/usr/local/etc/pspp
     include_path:        ./:~/.pspp/include:/usr/local/share/pspp
     groff_font_path:
~/.pspp/font:/usr/local/share/pspp/font:/usr/local/lib/groff/font:/usr/lib/gr
off/font:/usr/local/share/groff/font:/usr/share/groff/font
     locale_dir:          /usr/local/share/locale
     compiler version:    4.2.1 (SUSE Linux)
     Diagnosis: Segmentation Violation
     ******************************************************************
     ./bugs/agg_crash.sh: line 71:  3345 Abgebrochen             $SUPERVISOR
$here/../src/pspp $TESTFILE > /dev/null
     run_program
     FAILED
     FAIL: bugs/agg_crash.sh
     PASS: bugs/agg-crash-2.sh
     PASS: bugs/alpha-freq.sh
     PASS: bugs/big-input.sh
     Creating input data.  Please wait.
     PASS: bugs/big-input-2.sh
     PASS: bugs/comment-at-eof.sh
     PASS: bugs/compute-fmt.sh
     ******************************************************************
     You have discovered a bug in PSPP.
     
       Please report this, by sending an email to address@hidden,
     explaining what you were doing when this happened, and including
     a sample of your input file which caused it.
     Also, please copy the following lines into your bug report:
     
     bare_version:        0.4.0.1
     version:             GNU pspp 0.4.0.1
     stat_version:        GNU pspp 0.4.0.1 (Do 27. M??r 18:01:30 CET 2008).
     host_system:         x86_64-unknown-linux-gnu
     build_system:        x86_64-unknown-linux-gnu
     default_config_path: ~/.pspp:/usr/local/etc/pspp
     include_path:        ./:~/.pspp/include:/usr/local/share/pspp
     groff_font_path:
~/.pspp/font:/usr/local/share/pspp/font:/usr/local/lib/groff/font:/usr/lib/gr
off/font:/usr/local/share/groff/font:/usr/share/groff/font
     locale_dir:          /usr/local/share/locale
     compiler version:    4.2.1 (SUSE Linux)
     Diagnosis: Segmentation Violation
     ******************************************************************
     ./bugs/crosstabs.sh: line 79:  3425 Abgebrochen             $SUPERVISOR
$here/../src/pspp $TEMPDIR/ct.stat
     create program
     FAILED
     FAIL: bugs/crosstabs.sh
     PASS: bugs/crosstabs-crash.sh
     PASS: bugs/curtailed.sh
     ******************************************************************
     You have discovered a bug in PSPP.
     
       Please report this, by sending an email to address@hidden,
     explaining what you were doing when this happened, and including
     a sample of your input file which caused it.
     Also, please copy the following lines into your bug report:
     
     bare_version:        0.4.0.1
     version:             GNU pspp 0.4.0.1
     stat_version:        GNU pspp 0.4.0.1 (Do 27. M??r 18:01:30 CET 2008).
     host_system:         x86_64-unknown-linux-gnu
     build_system:        x86_64-unknown-linux-gnu
     default_config_path: ~/.pspp:/usr/local/etc/pspp
     include_path:        ./:~/.pspp/include:/usr/local/share/pspp
     groff_font_path:
~/.pspp/font:/usr/local/share/pspp/font:/usr/local/lib/groff/font:/usr/lib/gr
off/font:/usr/local/share/groff/font:/usr/share/groff/font
     locale_dir:          /usr/local/share/locale
     compiler version:    4.2.1 (SUSE Linux)
     Diagnosis: Segmentation Violation
     ******************************************************************
     ./bugs/data-crash.sh: line 62:  3464 Abgebrochen             $SUPERVISOR
$here/../src/pspp $TEMPDIR/ct.stat > /dev/null
     run program
     FAILED
     FAIL: bugs/data-crash.sh
     PASS: bugs/double-frequency.sh
     ******************************************************************
     You have discovered a bug in PSPP.
     
       Please report this, by sending an email to address@hidden,
     explaining what you were doing when this happened, and including
     a sample of your input file which caused it.
     Also, please copy the following lines into your bug report:
     
     bare_version:        0.4.0.1
     version:             GNU pspp 0.4.0.1
     stat_version:        GNU pspp 0.4.0.1 (Do 27. M??r 18:01:30 CET 2008).
     host_system:         x86_64-unknown-linux-gnu
     build_system:        x86_64-unknown-linux-gnu
     default_config_path: ~/.pspp:/usr/local/etc/pspp
     include_path:        ./:~/.pspp/include:/usr/local/share/pspp
     groff_font_path:
~/.pspp/font:/usr/local/share/pspp/font:/usr/local/lib/groff/font:/usr/lib/gr
off/font:/usr/local/share/groff/font:/usr/share/groff/font
     locale_dir:          /usr/local/share/locale
     compiler version:    4.2.1 (SUSE Linux)
     Diagnosis: Segmentation Violation
     ******************************************************************
     ./bugs/get.sh: line 82:  3486 Abgebrochen             $SUPERVISOR
$here/../src/pspp -o raw-ascii $TESTFILE
     run program
     NO RESULT
     FAIL: bugs/get.sh
     PASS: bugs/examine-1sample.sh
     ******************************************************************
     You have discovered a bug in PSPP.
     
       Please report this, by sending an email to address@hidden,
     explaining what you were doing when this happened, and including
     a sample of your input file which caused it.
     Also, please copy the following lines into your bug report:
     
     bare_version:        0.4.0.1
     version:             GNU pspp 0.4.0.1
     stat_version:        GNU pspp 0.4.0.1 (Do 27. M??r 18:01:30 CET 2008).
     host_system:         x86_64-unknown-linux-gnu
     build_system:        x86_64-unknown-linux-gnu
     default_config_path: ~/.pspp:/usr/local/etc/pspp
     include_path:        ./:~/.pspp/include:/usr/local/share/pspp
     groff_font_path:
~/.pspp/font:/usr/local/share/pspp/font:/usr/local/lib/groff/font:/usr/lib/gr
off/font:/usr/local/share/groff/font:/usr/share/groff/font
     locale_dir:          /usr/local/share/locale
     compiler version:    4.2.1 (SUSE Linux)
     Diagnosis: Segmentation Violation
     ******************************************************************
     ./bugs/get-no-file.sh: line 63:  3508 Done                    cat
$TESTFILE
           3509 Abgebrochen             | $SUPERVISOR $here/../src/pspp -o
raw-ascii > /dev/null
     run program
     FAILED
     FAIL: bugs/get-no-file.sh
     ******************************************************************
     You have discovered a bug in PSPP.
     
       Please report this, by sending an email to address@hidden,
     explaining what you were doing when this happened, and including
     a sample of your input file which caused it.
     Also, please copy the following lines into your bug report:
     
     bare_version:        0.4.0.1
     version:             GNU pspp 0.4.0.1
     stat_version:        GNU pspp 0.4.0.1 (Do 27. M??r 18:01:30 CET 2008).
     host_system:         x86_64-unknown-linux-gnu
     build_system:        x86_64-unknown-linux-gnu
     default_config_path: ~/.pspp:/usr/local/etc/pspp
     include_path:        ./:~/.pspp/include:/usr/local/share/pspp
     groff_font_path:
~/.pspp/font:/usr/local/share/pspp/font:/usr/local/lib/groff/font:/usr/lib/gr
off/font:/usr/local/share/groff/font:/usr/share/groff/font
     locale_dir:          /usr/local/share/locale
     compiler version:    4.2.1 (SUSE Linux)
     Diagnosis: Segmentation Violation
     ******************************************************************
     ./bugs/html-frequency.sh: line 72:  3523 Abgebrochen
$SUPERVISOR $here/../src/pspp -o html $TESTFILE
     run data
     FAILED
     FAIL: bugs/html-frequency.sh
     ******************************************************************
     You have discovered a bug in PSPP.
     
       Please report this, by sending an email to address@hidden,
     explaining what you were doing when this happened, and including
     a sample of your input file which caused it.
     Also, please copy the following lines into your bug report:
     
     bare_version:        0.4.0.1
     version:             GNU pspp 0.4.0.1
     stat_version:        GNU pspp 0.4.0.1 (Do 27. M??r 18:01:30 CET 2008).
     host_system:         x86_64-unknown-linux-gnu
     build_system:        x86_64-unknown-linux-gnu
     default_config_path: ~/.pspp:/usr/local/etc/pspp
     include_path:        ./:~/.pspp/include:/usr/local/share/pspp
     groff_font_path:
~/.pspp/font:/usr/local/share/pspp/font:/usr/local/lib/groff/font:/usr/lib/gr
off/font:/usr/local/share/groff/font:/usr/share/groff/font
     locale_dir:          /usr/local/share/locale
     compiler version:    4.2.1 (SUSE Linux)
     Diagnosis: Segmentation Violation
     ******************************************************************
     ./bugs/if_crash.sh: line 75:  3535 Abgebrochen             $SUPERVISOR
$here/../src/pspp $TESTFILE > /dev/null
     run_program
     FAILED
     FAIL: bugs/if_crash.sh
     ******************************************************************
     You have discovered a bug in PSPP.
     
       Please report this, by sending an email to address@hidden,
     explaining what you were doing when this happened, and including
     a sample of your input file which caused it.
     Also, please copy the following lines into your bug report:
     
     bare_version:        0.4.0.1
     version:             GNU pspp 0.4.0.1
     stat_version:        GNU pspp 0.4.0.1 (Do 27. M??r 18:01:30 CET 2008).
     host_system:         x86_64-unknown-linux-gnu
     build_system:        x86_64-unknown-linux-gnu
     default_config_path: ~/.pspp:/usr/local/etc/pspp
     include_path:        ./:~/.pspp/include:/usr/local/share/pspp
     groff_font_path:
~/.pspp/font:/usr/local/share/pspp/font:/usr/local/lib/groff/font:/usr/lib/gr
off/font:/usr/local/share/groff/font:/usr/share/groff/font
     locale_dir:          /usr/local/share/locale
     compiler version:    4.2.1 (SUSE Linux)
     Diagnosis: Segmentation Violation
     ******************************************************************
     ./bugs/input-crash.sh: line 72:  3547 Abgebrochen
$SUPERVISOR $here/../src/pspp --testing-mode -o raw-ascii $TESTFILE >
/dev/null
     run program
     FAILED
     FAIL: bugs/input-crash.sh
     PASS: bugs/lag_crash.sh
     ******************************************************************
     You have discovered a bug in PSPP.
     
       Please report this, by sending an email to address@hidden,
     explaining what you were doing when this happened, and including
     a sample of your input file which caused it.
     Also, please copy the following lines into your bug report:
     
     bare_version:        0.4.0.1
     version:             GNU pspp 0.4.0.1
     stat_version:        GNU pspp 0.4.0.1 (Do 27. M??r 18:01:30 CET 2008).
     host_system:         x86_64-unknown-linux-gnu
     build_system:        x86_64-unknown-linux-gnu
     default_config_path: ~/.pspp:/usr/local/etc/pspp
     include_path:        ./:~/.pspp/include:/usr/local/share/pspp
     groff_font_path:
~/.pspp/font:/usr/local/share/pspp/font:/usr/local/lib/groff/font:/usr/lib/gr
off/font:/usr/local/share/groff/font:/usr/share/groff/font
     locale_dir:          /usr/local/share/locale
     compiler version:    4.2.1 (SUSE Linux)
     Diagnosis: Segmentation Violation
     ******************************************************************
     ./bugs/match-files-scratch.sh: line 73:  3569 Abgebrochen
$SUPERVISOR $here/../src/pspp -o raw-ascii $TESTFILE
     create program
     NO RESULT
     FAIL: bugs/match-files-scratch.sh
     PASS: bugs/multipass.sh
     ******************************************************************
     You have discovered a bug in PSPP.
     
       Please report this, by sending an email to address@hidden,
     explaining what you were doing when this happened, and including
     a sample of your input file which caused it.
     Also, please copy the following lines into your bug report:
     
     bare_version:        0.4.0.1
     version:             GNU pspp 0.4.0.1
     stat_version:        GNU pspp 0.4.0.1 (Do 27. M??r 18:01:30 CET 2008).
     host_system:         x86_64-unknown-linux-gnu
     build_system:        x86_64-unknown-linux-gnu
     default_config_path: ~/.pspp:/usr/local/etc/pspp
     include_path:        ./:~/.pspp/include:/usr/local/share/pspp
     groff_font_path:
~/.pspp/font:/usr/local/share/pspp/font:/usr/local/lib/groff/font:/usr/lib/gr
off/font:/usr/local/share/groff/font:/usr/share/groff/font
     locale_dir:          /usr/local/share/locale
     compiler version:    4.2.1 (SUSE Linux)
     Diagnosis: Segmentation Violation
     ******************************************************************
     ./bugs/random.sh: line 70:  3593 Abgebrochen             $SUPERVISOR
$here/../src/pspp -o raw-ascii $TESTFILE
     run program
     NO RESULT
     FAIL: bugs/random.sh
     PASS: bugs/t-test-with-temp.sh
     PASS: bugs/t-test.sh
     PASS: bugs/t-test-alpha.sh
     PASS: bugs/t-test-alpha2.sh
     ./bugs/terminate.sh: line 69:  3656 Abgebrochen             $SUPERVISOR
$here/../src/pspp -o raw-ascii $TEMPDIR/foo.sps > /dev/null 2>
$TEMPDIR/stderr
     1,20c1
     < ******************************************************************
     < You have discovered a bug in PSPP.
     <
     <   Please report this, by sending an email to address@hidden,
     < explaining what you were doing when this happened, and including
     < a sample of your input file which caused it.
     < Also, please copy the following lines into your bug report:
     <
     < bare_version:        0.4.0.1
     < version:             GNU pspp 0.4.0.1
     < stat_version:        GNU pspp 0.4.0.1 (Do 27. M??r 18:01:30 CET 2008).
     < host_system:         x86_64-unknown-linux-gnu
     < build_system:        x86_64-unknown-linux-gnu
     < default_config_path: ~/.pspp:/usr/local/etc/pspp
     < include_path:        ./:~/.pspp/include:/usr/local/share/pspp
     < groff_font_path:
~/.pspp/font:/usr/local/share/pspp/font:/usr/local/lib/groff/font:/usr/lib/gr
off/font:/usr/local/share/groff/font:/usr/share/groff/font
     < locale_dir:          /usr/local/share/locale
     < compiler version:    4.2.1 (SUSE Linux)
     < Diagnosis: Segmentation Violation
     < ******************************************************************
     ---
     > pspp: Terminating NOW due to a fatal error!
     compare stderr
     FAILED
     FAIL: bugs/terminate.sh
     ******************************************************************
     You have discovered a bug in PSPP.
     
       Please report this, by sending an email to address@hidden,
     explaining what you were doing when this happened, and including
     a sample of your input file which caused it.
     Also, please copy the following lines into your bug report:
     
     bare_version:        0.4.0.1
     version:             GNU pspp 0.4.0.1
     stat_version:        GNU pspp 0.4.0.1 (Do 27. M??r 18:01:30 CET 2008).
     host_system:         x86_64-unknown-linux-gnu
     build_system:        x86_64-unknown-linux-gnu
     default_config_path: ~/.pspp:/usr/local/etc/pspp
     include_path:        ./:~/.pspp/include:/usr/local/share/pspp
     groff_font_path:
~/.pspp/font:/usr/local/share/pspp/font:/usr/local/lib/groff/font:/usr/lib/gr
off/font:/usr/local/share/groff/font:/usr/share/groff/font
     locale_dir:          /usr/local/share/locale
     compiler version:    4.2.1 (SUSE Linux)
     Diagnosis: Segmentation Violation
     ******************************************************************
     ./bugs/temporary.sh: line 75:  3669 Abgebrochen             $SUPERVISOR
$here/../src/pspp -o raw-ascii $TESTFILE
     create program
     NO RESULT
     FAIL: bugs/temporary.sh
     ******************************************************************
     You have discovered a bug in PSPP.
     
       Please report this, by sending an email to address@hidden,
     explaining what you were doing when this happened, and including
     a sample of your input file which caused it.
     Also, please copy the following lines into your bug report:
     
     bare_version:        0.4.0.1
     version:             GNU pspp 0.4.0.1
     stat_version:        GNU pspp 0.4.0.1 (Do 27. M??r 18:01:30 CET 2008).
     host_system:         x86_64-unknown-linux-gnu
     build_system:        x86_64-unknown-linux-gnu
     default_config_path: ~/.pspp:/usr/local/etc/pspp
     include_path:        ./:~/.pspp/include:/usr/local/share/pspp
     groff_font_path:
~/.pspp/font:/usr/local/share/pspp/font:/usr/local/lib/groff/font:/usr/lib/gr
off/font:/usr/local/share/groff/font:/usr/share/groff/font
     locale_dir:          /usr/local/share/locale
     compiler version:    4.2.1 (SUSE Linux)
     Diagnosis: Segmentation Violation
     ******************************************************************
     ./bugs/val-labs.sh: line 72:  3682 Abgebrochen             $SUPERVISOR
$here/../src/pspp -o raw-ascii $TESTFILE > /dev/null
     run program
     FAILED
     FAIL: bugs/val-labs.sh
     PASS: bugs/val-labs-trailing-slash.sh
     ******************************************************************
     You have discovered a bug in PSPP.
     
       Please report this, by sending an email to address@hidden,
     explaining what you were doing when this happened, and including
     a sample of your input file which caused it.
     Also, please copy the following lines into your bug report:
     
     bare_version:        0.4.0.1
     version:             GNU pspp 0.4.0.1
     stat_version:        GNU pspp 0.4.0.1 (Do 27. M??r 18:01:30 CET 2008).
     host_system:         x86_64-unknown-linux-gnu
     build_system:        x86_64-unknown-linux-gnu
     default_config_path: ~/.pspp:/usr/local/etc/pspp
     include_path:        ./:~/.pspp/include:/usr/local/share/pspp
     groff_font_path:
~/.pspp/font:/usr/local/share/pspp/font:/usr/local/lib/groff/font:/usr/lib/gr
off/font:/usr/local/share/groff/font:/usr/share/groff/font
     locale_dir:          /usr/local/share/locale
     compiler version:    4.2.1 (SUSE Linux)
     Diagnosis: Segmentation Violation
     ******************************************************************
     ./bugs/recode-copy-bug.sh: line 63:  3705 Abgebrochen
$SUPERVISOR $here/../src/pspp -o raw-ascii $TEMPDIR/recode-copy-bug-1.stat
     run program
     NO RESULT
     FAIL: bugs/recode-copy-bug.sh
     ******************************************************************
     You have discovered a bug in PSPP.
     
       Please report this, by sending an email to address@hidden,
     explaining what you were doing when this happened, and including
     a sample of your input file which caused it.
     Also, please copy the following lines into your bug report:
     
     bare_version:        0.4.0.1
     version:             GNU pspp 0.4.0.1
     stat_version:        GNU pspp 0.4.0.1 (Do 27. M??r 18:01:30 CET 2008).
     host_system:         x86_64-unknown-linux-gnu
     build_system:        x86_64-unknown-linux-gnu
     default_config_path: ~/.pspp:/usr/local/etc/pspp
     include_path:        ./:~/.pspp/include:/usr/local/share/pspp
     groff_font_path:
~/.pspp/font:/usr/local/share/pspp/font:/usr/local/lib/groff/font:/usr/lib/gr
off/font:/usr/local/share/groff/font:/usr/share/groff/font
     locale_dir:          /usr/local/share/locale
     compiler version:    4.2.1 (SUSE Linux)
     Diagnosis: Segmentation Violation
     ******************************************************************
     ./bugs/computebug.sh: line 59:  3717 Abgebrochen             $SUPERVISOR
$here/../src/pspp -o raw-ascii $TEMPDIR/computebug.stat
     run program
     NO RESULT
     FAIL: bugs/computebug.sh
     ******************************************************************
     You have discovered a bug in PSPP.
     
       Please report this, by sending an email to address@hidden,
     explaining what you were doing when this happened, and including
     a sample of your input file which caused it.
     Also, please copy the following lines into your bug report:
     
     bare_version:        0.4.0.1
     version:             GNU pspp 0.4.0.1
     stat_version:        GNU pspp 0.4.0.1 (Do 27. M??r 18:01:30 CET 2008).
     host_system:         x86_64-unknown-linux-gnu
     build_system:        x86_64-unknown-linux-gnu
     default_config_path: ~/.pspp:/usr/local/etc/pspp
     include_path:        ./:~/.pspp/include:/usr/local/share/pspp
     groff_font_path:
~/.pspp/font:/usr/local/share/pspp/font:/usr/local/lib/groff/font:/usr/lib/gr
off/font:/usr/local/share/groff/font:/usr/share/groff/font
     locale_dir:          /usr/local/share/locale
     compiler version:    4.2.1 (SUSE Linux)
     Diagnosis: Segmentation Violation
     ******************************************************************
     ./bugs/compute-lv.sh: line 69:  3731 Abgebrochen             $SUPERVISOR
$here/../src/pspp -o raw-ascii $TESTFILE
     run prog
     FAILED
     FAIL: bugs/compute-lv.sh
     PASS: bugs/temp-freq.sh
     PASS: xforms/casefile.sh
     PASS: stats/descript-basic.sh
     PASS: stats/descript-missing.sh
     PASS: stats/descript-mean-bug.sh
     PASS: stats/moments.sh
     PASS: stats/percentiles-compatible.sh
     PASS: stats/ntiles.sh
     PASS: stats/percentiles-enhanced.sh
     ./expressions/expressions.sh: line 1304:  3884 Abgebrochen
$SUPERVISOR $here/../src/pspp --testing-mode -o raw-ascii
$TEMPDIR/expr-opt.stat > $TEMPDIR/expr-opt.err 2> $TEMPDIR/expr-opt.out
     11,1133c11,30
     < 'string' AND $sysmis => error
     < 0 AND $sysmis => false
     < (1>2) + 1 => 1.00
     < $true + $false => 1.00
     < 1 + 2 => 3.00
     < 1 + $true => 2.00
     < $sysmis + 1 => sysmis
     < 7676 + $sysmis => sysmis
     < ('foo') + 5 => error
     < ('foo') + ('bar') => error
     < 'foo' + 'bar' => "foobar"
     < 1 +3 - 2 +4 -5 => 1.00
     < 1 - $true => 0.00
     < $true - 4/3 => -0.33
     < 'string' - 1e10 => error
     < 9.5 - '' => error
     < 1 - 2 => -1.00
     < 52 -23 => 29.00
     < 5 * 10 => 50.00
     < 10 * $true => 10.00
     < $true * 5 => 5.00
     < 1.5 * $true => 1.50
     < 5 * $sysmis => sysmis
     < $sysmis * 15 => sysmis
     < 2 * 5 / 10 => 1.00
     < 1 / 2 => 0.50
     < 2 / 5 => 0.40
     < 12 / 3 / 2 => 2.00
     < 2**8 => 256.00
     < (2**3)**4 => 4096.00
     < 2**3**4 => 4096.00
     < 2+-3 => -1.00
     < 2*-3 => -6.00
     < -3**2 => -9.00
     < (-3)**2 => 9.00
     < 2**-1 => 0.50
     < 0**0 => sysmis
     < 0**-1 => sysmis
     < (-3)**1.5 => sysmis
     < $false AND $false => false
     < $false AND $true => false
     < $false AND $sysmis => false
     < $true AND $false => false
     < $true AND $true => true
     < $true AND $sysmis => sysmis
     < $sysmis AND $false => false
     < $sysmis AND $true => sysmis
     < $sysmis AND $sysmis => sysmis
     < $false & $false => false
     < $false & $true => false
     < $false & $sysmis => false
     < $true & $false => false
     < $true & $true => true
     < $true & $sysmis => sysmis
     < $sysmis & $false => false
     < $sysmis & $true => sysmis
     < $sysmis & $sysmis => sysmis
     < $false OR $false => false
     < $false OR $true => true
     < $false OR $sysmis => sysmis
     < $true OR $false => true
     < $true OR $true => true
     < $true OR $sysmis => true
     < $sysmis OR $false => sysmis
     < $sysmis OR $true => true
     < $sysmis OR $sysmis => sysmis
     < $false | $false => false
     < $false | $true => true
     < $false | $sysmis => sysmis
     < $true | $false => true
     < $true | $true => true
     < $true | $sysmis => true
     < $sysmis | $false => sysmis
     < $sysmis | $true => true
     < $sysmis | $sysmis => sysmis
     < not $false => true
     < not 0 => true
     < not 2.5 => true
     < not $true => false
     < not 1 => false
     < not $sysmis => sysmis
     < ~ $false => true
     < ~ 0 => true
     < ~ 2.5 => true
     < ~ $true => false
     < ~ 1 => false
     < ~ $sysmis => sysmis
     < 1 eq 1 => true
     < 1 = 1 => true
     < 1 eq 2 => false
     < 2 = 3 => false
     < 1 eq 'foobar' => error
     < 5 eq 'foobar' => error
     < 'baz' = 10 => error
     < 'quux' = 5.55 => error
     < 'foobar' = 'foobar' => true
     < 'quux' = 'bar' => false
     < 'bar   ' = 'bar' => true
     < 'asdf         ' = 'asdf  ' => true
     < 'asdfj   ' = 'asdf' => false
     < 1 + 2 = 3 => true
     < 1 >= 2 = 2 ge 3 => false
     < 3 ne 2 ~= 1 => false
     < 3 > 2 > 1 => false
     < 1 <= 2 => true
     < 2.5 <= 1.5 => false
     < 1 le 2 => true
     < 2 <= 2 => true
     < 2 le 2 => true
     < 2 < = 2 => error
     < 1 <= 'foobar' => error
     < 5 <= 'foobar' => error
     < 'baz' <= 10 => error
     < 'quux' <= 5.55 => error
     < '0123' <= '0123' => true
     < '0123' <= '0124' => true
     < '0124' le '0123' => false
     < '0123  ' <= '0123' => true
     < '0123' le '0123  ' => true
     < 1 < 2 => true
     < 2.5 < 1.5 => false
     < 3.5 lt 4 => true
     < 4 lt 3.5 => false
     < 1 lt 'foobar' => error
     < 5 lt 'foobar' => error
     < 'baz' < 10 => error
     < 'quux' < 5.55 => error
     < '0123' lt '0123' => false
     < '0123' < '0124' => true
     < '0124' lt '0123' => false
     < '0123  ' < '0123' => false
     < '0123' lt '0123  ' => false
     < 1 >= 2 => false
     < 2.5 >= 1.5 => true
     < 1 ge 2 => false
     < 2 >= 2 => true
     < 2 ge 2 => true
     < 2 > = 2 => error
     < 1 >= 'foobar' => error
     < 5 ge 'foobar' => error
     < 'baz' ge 10 => error
     < 'quux' >= 5.55 => error
     < '0123' ge '0123' => true
     < '0123' >= '0124' => false
     < '0124' >= '0123' => true
     < '0123  ' ge '0123' => true
     < '0123' >= '0123  ' => true
     < 1 > 2 => false
     < 2.5 > 1.5 => true
     < 3.5 gt 4 => false
     < 4 gt 3.5 => true
     < 1 gt 'foobar' => error
     < 5 gt 'foobar' => error
     < 'baz' > 10 => error
     < 'quux' > 5.55 => error
     < '0123' gt '0123' => false
     < '0123' > '0124' => false
     < '0124' gt '0123' => true
     < '0123  ' > '0123' => false
     < '0123' gt '0123  ' => false
     < 1 ne 1 => false
     < 1 ~= 1 => false
     < 1 <> 2 => true
     < 2 ne 3 => true
     < 1 ~= 'foobar' => error
     < 5 <> 'foobar' => error
     < 'baz' ne 10 => error
     < 'quux' ~= 5.55 => error
     < 'foobar' <> 'foobar' => false
     < 'quux' ne 'bar' => true
     < 'bar   ' <> 'bar' => false
     < 'asdf         ' ~= 'asdf  ' => false
     < 'asdfj   ' ne 'asdf' => true
     < 1 < > 1 => error
     < 1 ~ = 1 => error
     < exp(10) => 22026.47
     < exp('x') => error
     < lg10(500) => 2.70
     < lg10('x') => error
     < ln(10) => 2.30
     < ln('x') => error
     < sqrt(500) => 22.36
     < sqrt('x') => error
     < abs(-10.5) => 10.50
     < abs(-55.79) => 55.79
     < abs(22) => 22.00
     < abs(0) => 0.00
     < mod(55.5, 2) => 1.50
     < mod(-55.5, 2) => -1.50
     < mod(55.5, -2) => 1.50
     < mod(-55.5, -2) => -1.50
     < mod('a', 2) => error
     < mod(2, 'a') => error
     < mod('a', 'b') => error
     < mod10(55.5) => 5.50
     < mod10(-55.5) => -5.50
     < mod10('x') => error
     < rnd(5.4) => 5.00
     < rnd(5.6) => 6.00
     < rnd(-5.4) => -5.00
     < rnd(-5.6) => -6.00
     < rnd('x') => error
     < trunc(1.2) => 1.00
     < trunc(1.9) => 1.00
     < trunc(-1.2) => -1.00
     < trunc(-1.9) => -1.00
     < trunc('x') => error
     < acos(.5) / 3.14159 * 180 => 60.00
     < arcos(.75) / 3.14159 * 180 => 41.41
     < arcos(-.5) / 3.14159 * 180 => 120.00
     < acos(-.75) / 3.14159 * 180 => 138.59
     < acos(-1) / 3.14159 * 180 => 180.00
     < arcos(1) / 3.14159 * 180 => 0.00
     < acos(-1.01) => sysmis
     < arcos(1.01) => sysmis
     < acos('x') => error
     < arsin(.5) / 3.14159 * 180 => 30.00
     < asin(.25) / 3.14159 * 180 => 14.48
     < arsin(-.5) / 3.14159 * 180 => -30.00
     < asin(-.25) / 3.14159 * 180 => -14.48
     < arsin(-1.01) => sysmis
     < asin(1.01) => sysmis
     < arsin('x') => error
     < artan(1) / 3.14159 * 180 => 45.00
     < atan(10) / 3.14159 * 180 => 84.29
     < artan(-1) / 3.14159 * 180 => -45.00
     < atan(-10) / 3.14159 * 180 => -84.29
     < artan('x') => error
     < cos(60 / 180 * 3.14159) => 0.50
     < cos(45 / 180 * 3.14159) => 0.71
     < cos(30 / 180 * 3.14159) => 0.87
     < cos(15 / 180 * 3.14159) => 0.97
     < cos(-60 / 180 * 3.14159) => 0.50
     < cos(-45 / 180 * 3.14159) => 0.71
     < cos(-30 / 180 * 3.14159) => 0.87
     < cos(-15 / 180 * 3.14159) => 0.97
     < cos(123 / 180 * 3.14159) => -0.54
     < cos(321 / 180 * 3.14159) => 0.78
     < cos('x') => error
     < sin(60 / 180 * 3.14159) => 0.87
     < sin(45 / 180 * 3.14159) => 0.71
     < sin(30 / 180 * 3.14159) => 0.50
     < sin(15 / 180 * 3.14159) => 0.26
     < sin(-60 / 180 * 3.14159) => -0.87
     < sin(-45 / 180 * 3.14159) => -0.71
     < sin(-30 / 180 * 3.14159) => -0.50
     < sin(-15 / 180 * 3.14159) => -0.26
     < sin(123 / 180 * 3.14159) => 0.84
     < sin(321 / 180 * 3.14159) => -0.63
     < sin('x') => error
     < tan(60 / 180 * 3.14159) => 1.73
     < tan(45 / 180 * 3.14159) => 1.00
     < tan(30 / 180 * 3.14159) => 0.58
     < tan(15 / 180 * 3.14159) => 0.27
     < tan(-60 / 180 * 3.14159) => -1.73
     < tan(-45 / 180 * 3.14159) => -1.00
     < tan(-30 / 180 * 3.14159) => -0.58
     < tan(-15 / 180 * 3.14159) => -0.27
     < tan(123 / 180 * 3.14159) => -1.54
     < tan(321 / 180 * 3.14159) => -0.81
     < tan('x') => error
     < missing(10) => false
     < missing($sysmis) => true
     < missing(asin(1.01)) => true
     < missing(asin(.5)) => false
     < missing('    ') => error
     < nmiss($sysmis) => 1.00
     < nmiss(0) => 0.00
     < nmiss($sysmis, $sysmis, $sysmis) => 3.00
     < nmiss(1, 2, 3, 4) => 0.00
     < nmiss(1, $sysmis, $sysmis, 2, 2, $sysmis, $sysmis, 3, 4) => 4.00
     < nvalid($sysmis) => 0.00
     < nvalid(0) => 1.00
     < nvalid($sysmis, $sysmis, $sysmis) => 0.00
     < nvalid(1, 2, 3, 4) => 4.00
     < nvalid(1, $sysmis, $sysmis, 2, 2, $sysmis, $sysmis, 3, 4) => 5.00
     < sysmis(10) => false
     < sysmis($sysmis) => true
     < sysmis(asin(1.01)) => true
     < sysmis(asin(.5)) => false
     < sysmis('    ') => error
     < any($sysmis, 1, $sysmis, 3) => sysmis
     < any(1, 1, 2, 3) => true
     < any(1, $true, 2, 3) => true
     < any(1, $false, 2, 3) => false
     < any(2, 1, 2, 3) => true
     < any(3, 1, 2, 3) => true
     < any(5, 1, 2, 3) => false
     < any(1, 1, 1, 1) => true
     < any($sysmis, 1, 1, 1) => sysmis
     < any(1, $sysmis, $sysmis, $sysmis) => sysmis
     < any($sysmis, $sysmis, $sysmis, $sysmis) => sysmis
     < any(1) => error
     < any('1', 2, 3, 4) => error
     < any(1, '2', 3, 4) => error
     < any(1, 2, '3', 4) => error
     < any(1, 2, 3, '4') => error
     < any('', 'a', '', 'c') => true
     < any('a', 'a', 'b', 'c') => true
     < any('b', 'a', 'b', 'c') => true
     < any('c', 'a', 'b', 'c') => true
     < any('e', 'a', 'b', 'c') => false
     < any('a', 'a', 'a', 'a') => true
     < any('', 'a', 'a', 'a') => false
     < any('a', '', '', '') => false
     < any('a') => error
     < any('a', 'a  ', 'b', 'c') => true
     < any('b   ', 'a', 'b', 'c') => true
     < any('c   ', 'a', 'b', 'c     ') => true
     < any(a, 'b', 'c', 'd') => error
     < any('a', b, 'c', 'd') => error
     < any('a', 'b', c, 'd') => error
     < any('a', 'b', 'c', d) => error
     < range(5, 1, 10) => true
     < range(1, 1, 10) => true
     < range(10, 1, 10) => true
     < range(-1, 1, 10) => false
     < range(12, 1, 10) => false
     < range($sysmis, 1, 10) => sysmis
     < range(5, 1, $sysmis) => sysmis
     < range(5, $sysmis, 10) => sysmis
     < range($sysmis, $sysmis, 10) => sysmis
     < range($sysmis, 1, $sysmis) => sysmis
     < range($sysmis, $sysmis, $sysmis) => sysmis
     < range(0, 1, 8, 10, 18) => false
     < range(1, 1, 8, 10, 18) => true
     < range(6, 1, 8, 10, 18) => true
     < range(8, 1, 8, 10, 18) => true
     < range(9, 1, 8, 10, 18) => false
     < range(10, 1, 8, 10, 18) => true
     < range(13, 1, 8, 10, 18) => true
     < range(16, 1, 8, 10, 18) => true
     < range(18, 1, 8, 10, 18) => true
     < range(20, 1, 8, 10, 18) => false
     < range(1) => error
     < range(1, 2) => error
     < range(1, 2, 3, 4) => error
     < range(1, 2, 3, 4, 5, 6) => error
     < range('1', 2, 3) => error
     < range(1, '2', 3) => error
     < range(1, 2, '3') => error
     < range('123', '111', '888') => true
     < range('111', '111', '888') => true
     < range('888', '111', '888') => true
     < range('110', '111', '888') => false
     < range('889', '111', '888') => false
     < range('000', '111', '888') => false
     < range('999', '111', '888') => false
     < range('123   ', '111', '888') => true
     < range('123', '111   ', '888') => true
     < range('123', '111', '888   ') => true
     < range('123', '111    ', '888   ') => true
     < range('00', '01', '08', '10', '18') => false
     < range('01', '01', '08', '10', '18') => true
     < range('06', '01', '08', '10', '18') => true
     < range('08', '01', '08', '10', '18') => true
     < range('09', '01', '08', '10', '18') => false
     < range('10', '01', '08', '10', '18') => true
     < range('15', '01', '08', '10', '18') => true
     < range('18', '01', '08', '10', '18') => true
     < range('19', '01', '08', '10', '18') => false
     < range('1') => error
     < range('1', '2') => error
     < range('1', '2', '3', '4') => error
     < range('1', '2', '3', '4', '5', '6') => error
     < range(1, '2', '3') => error
     < range('1', 2, '3') => error
     < range('1', '2', 3) => error
     < cfvar(1, 2, 3, 4, 5) => 0.53
     < cfvar(1, $sysmis, 2, 3, $sysmis, 4, 5) => 0.53
     < cfvar(1, 2) => 0.47
     < cfvar(1) => error
     < cfvar(1, $sysmis) => sysmis
     < cfvar(1, 2, 3, $sysmis) => 0.50
     < cfvar.4(1, 2, 3, $sysmis) => sysmis
     < cfvar.4(1, 2, 3) => error
     < cfvar('x') => error
     < cfvar('x', 1, 2, 3) => error
     < max(1, 2, 3, 4, 5) => 5.00
     < max(1, $sysmis, 2, 3, $sysmis, 4, 5) => 5.00
     < max(1, 2) => 2.00
     < max() => error
     < max(1) => 1.00
     < max(1, $sysmis) => 1.00
     < max(1, 2, 3, $sysmis) => 3.00
     < max.4(1, 2, 3, $sysmis) => sysmis
     < max.4(1, 2, 3) => error
     < max("2", "3", "5", "1", "4") => "5"
     < max("1", "2") => "2"
     < max("1") => "1"
     < mean(1, 2, 3, 4, 5) => 3.00
     < mean(1, $sysmis, 2, 3, $sysmis, 4, 5) => 3.00
     < mean(1, 2) => 1.50
     < mean() => error
     < mean(1) => 1.00
     < mean(1, $sysmis) => 1.00
     < mean(1, 2, 3, $sysmis) => 2.00
     < mean.4(1, 2, 3, $sysmis) => sysmis
     < mean.4(1, 2, 3) => error
     < min(1, 2, 3, 4, 5) => 1.00
     < min(1, $sysmis, 2, 3, $sysmis, 4, 5) => 1.00
     < min(1, 2) => 1.00
     < min() => error
     < min(1) => 1.00
     < min(1, $sysmis) => 1.00
     < min(1, 2, 3, $sysmis) => 1.00
     < min.4(1, 2, 3, $sysmis) => sysmis
     < min.4(1, 2, 3) => error
     < min("2", "3", "5", "1", "4") => "1"
     < min("1", "2") => "1"
     < min("1") => "1"
     < sd(1, 2, 3, 4, 5) => 1.58
     < sd(1, $sysmis, 2, 3, $sysmis, 4, 5) => 1.58
     < sd(1, 2) => 0.71
     < sd(1) => error
     < sd(1, $sysmis) => sysmis
     < sd(1, 2, 3, $sysmis) => 1.00
     < sd.4(1, 2, 3, $sysmis) => sysmis
     < sd.4(1, 2, 3) => error
     < sd('x') => error
     < sd('x', 1, 2, 3) => error
     < sum(1, 2, 3, 4, 5) => 15.00
     < sum(1, $sysmis, 2, 3, $sysmis, 4, 5) => 15.00
     < sum(1, 2) => 3.00
     < sum() => error
     < sum(1) => 1.00
     < sum(1, $sysmis) => 1.00
     < sum(1, 2, 3, $sysmis) => 6.00
     < sum.4(1, 2, 3, $sysmis) => sysmis
     < sum.4(1, 2, 3) => error
     < variance(1, 2, 3, 4, 5) => 2.50
     < variance(1, $sysmis, 2, 3, $sysmis, 4, 5) => 2.50
     < variance(1, 2) => 0.50
     < variance(1) => error
     < variance(1, $sysmis) => sysmis
     < variance(1, 2, 3, $sysmis) => 1.00
     < variance.4(1, 2, 3, $sysmis) => sysmis
     < variance.4(1, 2, 3) => error
     < variance('x') => error
     < variance('x', 1, 2, 3) => error
     < concat('') => ""
     < concat('a', 'b') => "ab"
     < concat('a', 'b', 'c', 'd', 'e', 'f', 'g', 'h') => "abcdefgh"
     < concat('abcdefgh', 'ijklmnopq') => "abcdefghijklmnopq"
     < concat('a', 1) => error
     < concat(1, 2) => error
     < index('abcbcde', 'bc') => 2.00
     < index('abcbcde', 'bcd') => 4.00
     < index('abcbcde', 'bcbc') => 2.00
     < index('abcdefgh', 'abc') => 1.00
     < index('abcdefgh', 'bcd') => 2.00
     < index('abcdefgh', 'cde') => 3.00
     < index('abcdefgh', 'def') => 4.00
     < index('abcdefgh', 'efg') => 5.00
     < index('abcdefgh', 'fgh') => 6.00
     < index('abcdefgh', 'fghi') => 0.00
     < index('abcdefgh', 'x') => 0.00
     < index('abcdefgh', 'abch') => 0.00
     < index('banana', 'na') => 3.00
     < index('banana', 'ana') => 2.00
     < index('', 'x') => 0.00
     < index('', '') => sysmis
     < index('abcdefgh', '') => sysmis
     < index('abcdefgh', 'alkjsfdjlskalkjfa') => 0.00
     < index('abcbcde', 'bc', 1) => 2.00
     < index('abcbcde', 'dc', 1) => 3.00
     < index('abcbcde', 'abc', 1) => 1.00
     < index('abcbcde', 'bc', 2) => 2.00
     < index('abcbcde', 'dc', 2) => 0.00
     < index('abcbcde', 'abc', 1) => 1.00
     < index('abcbcde', 'bccb', 2) => 2.00
     < index('abcbcde', 'bcbc', 2) => 2.00
     < index('abcbcde', 'bcbc', $sysmis) => sysmis
     < rindex('abcbcde', 'bc') => 4.00
     < rindex('abcbcde', 'bcd') => 4.00
     < rindex('abcbcde', 'bcbc') => 2.00
     < rindex('abcdefgh', 'abc') => 1.00
     < rindex('abcdefgh', 'bcd') => 2.00
     < rindex('abcdefgh', 'cde') => 3.00
     < rindex('abcdefgh', 'def') => 4.00
     < rindex('abcdefgh', 'efg') => 5.00
     < rindex('abcdefgh', 'fgh') => 6.00
     < rindex('abcdefgh', 'fghi') => 0.00
     < rindex('abcdefgh', 'x') => 0.00
     < rindex('abcdefgh', 'abch') => 0.00
     < rindex('banana', 'na') => 5.00
     < rindex('banana', 'ana') => 4.00
     < rindex('', 'x') => 0.00
     < rindex('', '') => sysmis
     < rindex('abcdefgh', '') => sysmis
     < rindex('abcdefgh', 'alkjsfdjlskalkjfa') => 0.00
     < rindex('abcbcde', 'bc', 1) => 5.00
     < rindex('abcbcde', 'dc', 1) => 6.00
     < rindex('abcbcde', 'abc', 1) => 5.00
     < rindex('abcbcde', 'bc', 2) => 4.00
     < rindex('abcbcde', 'dc', 2) => 0.00
     < rindex('abcbcde', 'abc', 1) => 5.00
     < rindex('abcbcde', 'bccb', 2) => 4.00
     < rindex('abcbcde', 'bcbc', 2) => 4.00
     < rindex('abcbcde', 'bcbc', $sysmis) => sysmis
     < rindex('abcbcde', 'bcbcg', 2) => sysmis
     < rindex('abcbcde', 'bcbcg', $sysmis) => sysmis
     < rindex('abcbcde', 'bcbcg', 'x') => error
     < rindex(1, 'bcdfkjl', 2) => error
     < rindex('aksj', 2, 2) => error
     < rindex(1, 2, 3) => error
     < rindex(1, 2, '3') => error
     < length('') => 0.00
     < length('a') => 1.00
     < length('xy') => 2.00
     < length('adsf    ') => 8.00
     < length('abcdefghijkl') => 12.00
     < length(0) => error
     < length($sysmis) => error
     < lower('address@hidden&*(089') =>
"address@hidden&*(089"
     < lower('') => ""
     < lower(1) => error
     < lpad('abc', -1) => ""
     < lpad('abc', 0) => "abc"
     < lpad('abc', 2) => "abc"
     < lpad('abc', 3) => "abc"
     < lpad('abc', 10) => "       abc"
     < lpad('abc', 256) => ""
     < lpad('abc', $sysmis) => ""
     < lpad('abc', -1, '*') => ""
     < lpad('abc', 0, '*') => "abc"
     < lpad('abc', 2, '*') => "abc"
     < lpad('abc', 3, '*') => "abc"
     < lpad('abc', 10, '*') => "*******abc"
     < lpad('abc', 256, '*') => ""
     < lpad('abc', $sysmis, '*') => ""
     < lpad('abc', $sysmis, '') => ""
     < lpad('abc', $sysmis, 'xy') => ""
     < lpad(0, 10) => error
     < lpad('abc', 'def') => error
     < lpad(0, 10, ' ') => error
     < lpad('abc', 'def', ' ') => error
     < lpad('x', 5, 0) => error
     < lpad('x', 5, 2) => error
     < number("123", f3.0) => 123.00
     < number(" 123", f3.0) => 12.00
     < number("123", f3.1) => 12.30
     < number("   ", f3.1) => sysmis
     < number("123", a8) => error
     < number("123", cca1.2) => error
     < ltrim('   abc') => "abc"
     < rtrim('   abc   ') => "   abc"
     < ltrim('abc') => "abc"
     < ltrim('       abc') => "      abc"
     < ltrim('    ') => ""
     < ltrim('') => ""
     < ltrim(8) => error
     < ltrim('***abc', '*') => "abc"
     < ltrim('abc', '*') => "abc"
     < ltrim('*abc', '*') => "abc"
     < ltrim('', '*') => ""
     < ltrim(8, '*') => error
     < ltrim(' x', 8) => error
     < ltrim(8, 9) => error
     < rpad('abc', -1) => ""
     < rpad('abc', 0) => "abc"
     < rpad('abc', 2) => "abc"
     < rpad('abc', 3) => "abc"
     < rpad('abc', 10) => "abc       "
     < rpad('abc', 256) => ""
     < rpad('abc', $sysmis) => ""
     < rpad('abc', -1, '*') => ""
     < rpad('abc', 0, '*') => "abc"
     < rpad('abc', 2, '*') => "abc"
     < rpad('abc', 3, '*') => "abc"
     < rpad('abc', 10, '*') => "abc*******"
     < rpad('abc', 256, '*') => ""
     < rpad('abc', $sysmis, '*') => ""
     < rpad('abc', $sysmis, '') => ""
     < rpad('abc', $sysmis, 'xy') => ""
     < rpad(0, 10) => error
     < rpad('abc', 'def') => error
     < rpad(0, 10, ' ') => error
     < rpad('abc', 'def', ' ') => error
     < rpad('x', 5, 0) => error
     < rpad('x', 5, 2) => error
     < rtrim('abc   ') => "abc"
     < rtrim('   abc   ') => "   abc"
     < rtrim('abc') => "abc"
     < rtrim('abc    ') => "abc      "
     < rtrim('    ') => ""
     < rtrim('') => ""
     < rtrim(8) => error
     < rtrim('abc***', '*') => "abc"
     < rtrim('abc', '*') => "abc"
     < rtrim('abc*', '*') => "abc"
     < rtrim('', '*') => ""
     < rtrim(8, '*') => error
     < rtrim(' x', 8) => error
     < rtrim(8, 9) => error
     < string(123.56, f5.1) => "123.6"
     < string($sysmis, f5.1) => "   . "
     < string("abc", A5) => error
     < string(123, e1) => error
     < string(123, e6.0) => " 1E+02"
     < substr('abcdefgh', -5) => ""
     < substr('abcdefgh', 0) => ""
     < substr('abcdefgh', 1) => "abcdefgh"
     < substr('abcdefgh', 3) => "cdefgh"
     < substr('abcdefgh', 5) => "efgh"
     < substr('abcdefgh', 6) => "fgh"
     < substr('abcdefgh', 7) => "gh"
     < substr('abcdefgh', 8) => "h"
     < substr('abcdefgh', 9) => ""
     < substr('abcdefgh', 10) => ""
     < substr('abcdefgh', 20) => ""
     < substr('abcdefgh', $sysmis) => ""
     < substr(0, 10) => error
     < substr('abcd', 'abc') => error
     < substr(0, 'abc') => error
     < substr('abcdefgh', 0, 0) => ""
     < substr('abcdefgh', 3, 0) => ""
     < substr('abcdefgh', 5, 0) => ""
     < substr('abcdefgh', 9, 0) => ""
     < substr('abcdefgh', 0, 1) => ""
     < substr('abcdefgh', 0, 5) => ""
     < substr('abcdefgh', 1, 8) => "abcdefgh"
     < substr('abcdefgh', 1, 10) => "abcdefgh"
     < substr('abcdefgh', 1, 20) => "abcdefgh"
     < substr('abcdefgh', 3, 4) => "cdef"
     < substr('abcdefgh', 5, 2) => "ef"
     < substr('abcdefgh', 6, 1) => "f"
     < substr('abcdefgh', 7, 10) => "gh"
     < substr('abcdefgh', 8, 1) => "h"
     < substr('abcdefgh', 8, 2) => "h"
     < substr('abcdefgh', 9, 11) => ""
     < substr('abcdefgh', 10, 52) => ""
     < substr('abcdefgh', 20, 1) => ""
     < substr('abcdefgh', $sysmis, 2) => ""
     < substr('abcdefgh', 9, $sysmis) => ""
     < substr('abcdefgh', $sysmis, $sysmis) => ""
     < substr('abc', 1, 'x') => error
     < substr(0, 10, 1) => error
     < substr(0, 10, 'x') => error
     < substr('abcd', 'abc', 0) => error
     < substr('abcd', 'abc', 'j') => error
     < substr(0, 'abc', 4) => error
     < substr(0, 'abc', 'k') => error
     < upcase('address@hidden&*(089') =>
"address@hidden&*(089"
     < upcase('') => ""
     < upcase(1) => error
     < time.days(1) => 86400.00
     < time.days(-1) => -86400.00
     < time.days(0.5) => 43200.00
     < time.days('x') => error
     < time.days($sysmis) => sysmis
     < time.hms(4,50,38) => 17438.00
     < time.hms(12,31,35) => 45095.00
     < time.hms(12,47,53) => 46073.00
     < time.hms(1,26,0) => 5160.00
     < time.hms(20,58,11) => 75491.00
     < time.hms(7,36,5) => 27365.00
     < time.hms(15,43,49) => 56629.00
     < time.hms(4,25,9) => 15909.00
     < time.hms(6,49,27) => 24567.00
     < time.hms(2,57,52) => 10672.00
     < time.hms(16,45,44) => 60344.00
     < time.hms(21,30,57) => 77457.00
     < time.hms(22,30,4) => 81004.00
     < time.hms(1,56,51) => 7011.00
     < time.hms(5, 6, 7) => 18367.00
     < time.hms(5, 6, 0) => 18360.00
     < time.hms(5, 0, 7) => 18007.00
     < time.hms(0, 6, 7) => 367.00
     < time.hms(-5, 6, -7) => sysmis
     < time.hms(-5, 5, -7) => sysmis
     < time.hms($sysmis, 6, 7) => sysmis
     < time.hms(5, $sysmis, 7) => sysmis
     < time.hms(5, $sysmis, 7) => sysmis
     < time.hms($sysmis, $sysmis, 7) => sysmis
     < time.hms(5, $sysmis, $sysmis) => sysmis
     < time.hms($sysmis, $sysmis, 7) => sysmis
     < time.hms($sysmis, $sysmis, $sysmis) => sysmis
     < ctime.days(106272) => 1.23
     < ctime.hours(106272) => 29.52
     < ctime.minutes(106272) => 1771.20
     < ctime.seconds(106272) => 106272.00
     < ctime.days(-106272) => -1.23
     < ctime.hours(-106272) => -29.52
     < ctime.minutes(-106272) => -1771.20
     < ctime.seconds(-106272) => -106272.00
     < ctime.days($sysmis) => sysmis
     < ctime.hours($sysmis) => sysmis
     < ctime.minutes($sysmis) => sysmis
     < ctime.seconds($sysmis) => sysmis
     < ctime.days('a') => error
     < ctime.hours('b') => error
     < ctime.minutes('c') => error
     < ctime.seconds('d') => error
     < ctime.days(date.dmy(15,10,1582)) => 1.00
     < ctime.days(date.dmy(6,9,1719)) => 50000.00
     < ctime.days(date.dmy(24,1,1583)) => 102.00
     < ctime.days(date.dmy(14,12,1585)) => 1157.00
     < ctime.days(date.dmy(26,11,1621)) => 14288.00
     < ctime.days(date.dmy(25,12,1821)) => 87365.00
     < ctime.days(date.dmy(3,12,1882)) => 109623.00
     < ctime.days(date.dmy(6,4,2002)) => 153211.00
     < ctime.days(date.dmy(19,12,1999)) => 152372.00
     < ctime.days(date.dmy(1,10,1978)) => 144623.00
     < ctime.days(date.dmy(0,10,1978)) => 144622.00
     < ctime.days(date.dmy(32,10,1978)) => sysmis
     < ctime.days(date.dmy(31,0,1978)) => 144349.00
     < ctime.days(date.dmy(31,13,1978)) => 144745.00
     < ctime.days(date.dmy($sysmis,10,1978)) => sysmis
     < ctime.days(date.dmy(31,$sysmis,1978)) => sysmis
     < ctime.days(date.dmy(31,10,$sysmis)) => sysmis
     < ctime.days(date.dmy($sysmis,$sysmis,1978)) => sysmis
     < ctime.days(date.dmy(31,$sysmis,$sysmis)) => sysmis
     < ctime.days(date.dmy($sysmis,10,$sysmis)) => sysmis
     < ctime.days(date.dmy($sysmis,$sysmis,$sysmis)) => sysmis
     < date.dmy('a',1,2) => error
     < date.dmy(1,'a',2) => error
     < date.dmy(1,2,'a') => error
     < yrmoda(1582,10,15) => 1.00
     < yrmoda(1719,9,6) => 50000.00
     < yrmoda(1583,1,24) => 102.00
     < yrmoda(1585,12,14) => 1157.00
     < yrmoda(1621,11,26) => 14288.00
     < yrmoda(1821,12,25) => 87365.00
     < yrmoda(1882,12,3) => 109623.00
     < yrmoda(2002,4,6) => 153211.00
     < yrmoda(1999,12,19) => 152372.00
     < yrmoda(1978,10,1) => 144623.00
     < yrmoda(1978,10,0) => 144622.00
     < yrmoda(1978,10,32) => sysmis
     < yrmoda(1978,0,31) => 144349.00
     < yrmoda(1978,13,31) => 144745.00
     < yrmoda(1978,10,$sysmis) => sysmis
     < yrmoda(1978,$sysmis,31) => sysmis
     < yrmoda($sysmis,10,31) => sysmis
     < yrmoda(1978,$sysmis,$sysmis) => sysmis
     < yrmoda($sysmis,$sysmis,31) => sysmis
     < yrmoda($sysmis,10,$sysmis) => sysmis
     < yrmoda($sysmis,$sysmis,$sysmis) => sysmis
     < yrmoda('a',1,2) => error
     < yrmoda(1,'a',2) => error
     < yrmoda(1,2,'a') => error
     < ctime.days(date.mdy(6,10,1648)) + 577735 => 601716.00
     < ctime.days(date.mdy(6,30,1680)) + 577735 => 613424.00
     < ctime.days(date.mdy(7,24,1716)) + 577735 => 626596.00
     < ctime.days(date.mdy(6,19,1768)) + 577735 => 645554.00
     < ctime.days(date.mdy(8,2,1819)) + 577735 => 664224.00
     < ctime.days(date.mdy(3,27,1839)) + 577735 => 671401.00
     < ctime.days(date.mdy(4,19,1903)) + 577735 => 694799.00
     < ctime.days(date.mdy(8,25,1929)) + 577735 => 704424.00
     < ctime.days(date.mdy(9,29,1941)) + 577735 => 708842.00
     < ctime.days(date.mdy(4,19,1943)) + 577735 => 709409.00
     < ctime.days(date.mdy(10,7,1943)) + 577735 => 709580.00
     < ctime.days(date.mdy(3,17,1992)) + 577735 => 727274.00
     < ctime.days(date.mdy(2,25,1996)) + 577735 => 728714.00
     < ctime.days(date.mdy(11,10,2038)) + 577735 => 744313.00
     < ctime.days(date.mdy(7,18,2094)) + 577735 => 764652.00
     < ctime.days(date.mdy(10,15,1582)) => 1.00
     < ctime.days(date.mdy(9,6,1719)) => 50000.00
     < ctime.days(date.mdy(1,24,1583)) => 102.00
     < ctime.days(date.mdy(12,14,1585)) => 1157.00
     < ctime.days(date.mdy(11,26,1621)) => 14288.00
     < ctime.days(date.mdy(12,25,1821)) => 87365.00
     < ctime.days(date.mdy(12,3,1882)) => 109623.00
     < ctime.days(date.mdy(4,6,2002)) => 153211.00
     < ctime.days(date.mdy(12,19,1999)) => 152372.00
     < ctime.days(date.mdy(10,1,1978)) => 144623.00
     < ctime.days(date.mdy(10,0,1978)) => 144622.00
     < ctime.days(date.mdy(10,32,1978)) => sysmis
     < ctime.days(date.mdy(0,31,1978)) => 144349.00
     < ctime.days(date.mdy(13,31,1978)) => 144745.00
     < ctime.days(date.mdy(10,$sysmis,1978)) => sysmis
     < ctime.days(date.mdy($sysmis,31,1978)) => sysmis
     < ctime.days(date.mdy(10,31,$sysmis)) => sysmis
     < ctime.days(date.mdy($sysmis,$sysmis,1978)) => sysmis
     < ctime.days(date.mdy($sysmis,31,$sysmis)) => sysmis
     < ctime.days(date.mdy(10,$sysmis,$sysmis)) => sysmis
     < ctime.days(date.mdy($sysmis,$sysmis,$sysmis)) => sysmis
     < date.mdy('a',1,2) => error
     < date.mdy(1,'a',2) => error
     < date.mdy(1,2,'a') => error
     < ctime.days(date.mdy(0,0,0)) => 152353.00
     < ctime.days(date.mdy(0,0,999)) => sysmis
     < date.mdy(1,1,1582) => sysmis
     < date.mdy(10,14,1582) => sysmis
     < date.mdy(10,15,1582) => 86400.00
     < ctime.days(date.moyr(1,2000)) => 152385.00
     < ctime.days(date.moyr(2,2000)) => 152416.00
     < ctime.days(date.moyr(3,2000)) => 152445.00
     < ctime.days(date.moyr(4,2000)) => 152476.00
     < ctime.days(date.moyr(5,2000)) => 152506.00
     < ctime.days(date.moyr(13,2000)) => 152751.00
     < ctime.days(date.moyr(14,2000)) => sysmis
     < ctime.days(date.moyr($sysmis,2000)) => sysmis
     < ctime.days(date.moyr(1,$sysmis)) => sysmis
     < ctime.days(date.moyr($sysmis,$sysmis)) => sysmis
     < date.moyr('a',2000) => error
     < date.moyr(5,'a') => error
     < date.moyr('a','b') => error
     < ctime.days(date.qyr(1,2000)) => 152385.00
     < ctime.days(date.qyr(2,2000)) => 152476.00
     < ctime.days(date.qyr(5,2000)) => 152751.00
     < ctime.days(date.qyr(6,2000)) => sysmis
     < ctime.days(date.qyr($sysmis,2000)) => sysmis
     < ctime.days(date.qyr(1,$sysmis)) => sysmis
     < ctime.days(date.qyr($sysmis,$sysmis)) => sysmis
     < date.qyr('a',2000) => error
     < date.qyr(5,'a') => error
     < date.qyr('a','b') => error
     < ctime.days(date.wkyr(1,2000)) => 152385.00
     < ctime.days(date.wkyr(15,1999)) => 152118.00
     < ctime.days(date.wkyr(36,1999)) => 152265.00
     < ctime.days(date.wkyr(54,1999)) => sysmis
     < ctime.days(date.wkyr($sysmis,1999)) => sysmis
     < ctime.days(date.wkyr(1,$sysmis)) => sysmis
     < ctime.days(date.wkyr($sysmis,$sysmis)) => sysmis
     < date.wkyr('a',1999) => error
     < date.wkyr(5,'a') => error
     < date.wkyr('a','b') => error
     < ctime.days(date.yrday(2000,1)) => 152385.00
     < ctime.days(date.yrday(2000,100)) => 152484.00
     < ctime.days(date.yrday(2000,253)) => 152637.00
     < ctime.days(date.yrday(2000,500)) => sysmis
     < ctime.days(date.yrday(2000,-100)) => sysmis
     < ctime.days(date.yrday(1999,$sysmis)) => sysmis
     < ctime.days(date.yrday($sysmis,1)) => sysmis
     < ctime.days(date.yrday($sysmis,$sysmis)) => sysmis
     < date.yrday(1999,'a') => error
     < date.yrday('a',5) => error
     < date.yrday('a','b') => error
     < xdate.date(date.mdy(6,10,1648) + time.hms(0,0,0)) / 86400 => 23981.00
     < xdate.date(date.mdy(6,30,1680) + time.hms(4,50,38)) / 86400 =>
35689.00
     < xdate.date(date.mdy(7,24,1716) + time.hms(12,31,35)) / 86400 =>
48861.00
     < xdate.date(date.mdy(6,19,1768) + time.hms(12,47,53)) / 86400 =>
67819.00
     < xdate.date(date.mdy(8,2,1819) + time.hms(1,26,0)) / 86400 => 86489.00
     < xdate.date(date.mdy(3,27,1839) + time.hms(20,58,11)) / 86400 =>
93666.00
     < xdate.date(date.mdy(4,19,1903) + time.hms(7,36,5)) / 86400 =>
117064.00
     < xdate.date(date.mdy(8,25,1929) + time.hms(15,43,49)) / 86400 =>
126689.00
     < xdate.date(date.mdy(9,29,1941) + time.hms(4,25,9)) / 86400 =>
131107.00
     < xdate.date(date.mdy(4,19,1943) + time.hms(6,49,27)) / 86400 =>
131674.00
     < xdate.date(date.mdy(10,7,1943) + time.hms(2,57,52)) / 86400 =>
131845.00
     < xdate.date(date.mdy(3,17,1992) + time.hms(16,45,44)) / 86400 =>
149539.00
     < xdate.date(date.mdy(2,25,1996) + time.hms(21,30,57)) / 86400 =>
150979.00
     < xdate.date(date.mdy(9,29,41) + time.hms(4,25,9)) / 86400 => 131107.00
     < xdate.date(date.mdy(4,19,43) + time.hms(6,49,27)) / 86400 => 131674.00
     < xdate.date(date.mdy(10,7,43) + time.hms(2,57,52)) / 86400 => 131845.00
     < xdate.date(date.mdy(3,17,92) + time.hms(16,45,44)) / 86400 =>
149539.00
     < xdate.date(date.mdy(2,25,96) + time.hms(21,30,57)) / 86400 =>
150979.00
     < xdate.date(date.mdy(11,10,2038) + time.hms(22,30,4)) / 86400 =>
166578.00
     < xdate.date(date.mdy(7,18,2094) + time.hms(1,56,51)) / 86400 =>
186917.00
     < xdate.date(123.4) => 0.00
     < xdate.date('') => error
     < xdate.hour(date.mdy(6,10,1648) + time.hms(0,0,0)) => 0.00
     < xdate.hour(date.mdy(6,30,1680) + time.hms(4,50,38)) => 4.00
     < xdate.hour(date.mdy(7,24,1716) + time.hms(12,31,35)) => 12.00
     < xdate.hour(date.mdy(6,19,1768) + time.hms(12,47,53)) => 12.00
     < xdate.hour(date.mdy(8,2,1819) + time.hms(1,26,0)) => 1.00
     < xdate.hour(date.mdy(3,27,1839) + time.hms(20,58,11)) => 20.00
     < xdate.hour(date.mdy(4,19,1903) + time.hms(7,36,5)) => 7.00
     < xdate.hour(date.mdy(8,25,1929) + time.hms(15,43,49)) => 15.00
     < xdate.hour(date.mdy(9,29,1941) + time.hms(4,25,9)) => 4.00
     < xdate.hour(date.mdy(4,19,1943) + time.hms(6,49,27)) => 6.00
     < xdate.hour(date.mdy(10,7,1943) + time.hms(2,57,52)) => 2.00
     < xdate.hour(date.mdy(3,17,1992) + time.hms(16,45,44)) => 16.00
     < xdate.hour(date.mdy(2,25,1996) + time.hms(21,30,57)) => 21.00
     < xdate.hour(date.mdy(9,29,41) + time.hms(4,25,9)) => 4.00
     < xdate.hour(date.mdy(4,19,43) + time.hms(6,49,27)) => 6.00
     < xdate.hour(date.mdy(10,7,43) + time.hms(2,57,52)) => 2.00
     < xdate.hour(date.mdy(3,17,92) + time.hms(16,45,44)) => 16.00
     < xdate.hour(date.mdy(2,25,96) + time.hms(21,30,57)) => 21.00
     < xdate.hour(date.mdy(11,10,2038) + time.hms(22,30,4)) => 22.00
     < xdate.hour(date.mdy(7,18,2094) + time.hms(1,56,51)) => 1.00
     < xdate.hour(-1) => -1.00
     < xdate.hour(1) => 0.00
     < xdate.hour($sysmis) => sysmis
     < xdate.hour('') => error
     < xdate.jday(date.mdy(6,10,1648) + time.hms(0,0,0)) => 162.00
     < xdate.jday(date.mdy(6,30,1680) + time.hms(4,50,38)) => 182.00
     < xdate.jday(date.mdy(7,24,1716) + time.hms(12,31,35)) => 206.00
     < xdate.jday(date.mdy(6,19,1768) + time.hms(12,47,53)) => 171.00
     < xdate.jday(date.mdy(8,2,1819) + time.hms(1,26,0)) => 214.00
     < xdate.jday(date.mdy(3,27,1839) + time.hms(20,58,11)) => 86.00
     < xdate.jday(date.mdy(4,19,1903) + time.hms(7,36,5)) => 109.00
     < xdate.jday(date.mdy(8,25,1929) + time.hms(15,43,49)) => 237.00
     < xdate.jday(date.mdy(9,29,1941) + time.hms(4,25,9)) => 272.00
     < xdate.jday(date.mdy(4,19,1943) + time.hms(6,49,27)) => 109.00
     < xdate.jday(date.mdy(10,7,1943) + time.hms(2,57,52)) => 280.00
     < xdate.jday(date.mdy(3,17,1992) + time.hms(16,45,44)) => 77.00
     < xdate.jday(date.mdy(2,25,1996) + time.hms(21,30,57)) => 56.00
     < xdate.jday(date.mdy(9,29,41) + time.hms(4,25,9)) => 272.00
     < xdate.jday(date.mdy(4,19,43) + time.hms(6,49,27)) => 109.00
     < xdate.jday(date.mdy(10,7,43) + time.hms(2,57,52)) => 280.00
     < xdate.jday(date.mdy(3,17,92) + time.hms(16,45,44)) => 77.00
     < xdate.jday(date.mdy(2,25,96) + time.hms(21,30,57)) => 56.00
     < xdate.jday(date.mdy(11,10,2038) + time.hms(22,30,4)) => 314.00
     < xdate.jday(date.mdy(7,18,2094) + time.hms(1,56,51)) => 199.00
     < xdate.jday(0) => sysmis
     < xdate.jday(1) => sysmis
     < xdate.jday(86400) => 288.00
     < xdate.mday(date.mdy(6,10,1648) + time.hms(0,0,0)) => 10.00
     < xdate.mday(date.mdy(6,30,1680) + time.hms(4,50,38)) => 30.00
     < xdate.mday(date.mdy(7,24,1716) + time.hms(12,31,35)) => 24.00
     < xdate.mday(date.mdy(6,19,1768) + time.hms(12,47,53)) => 19.00
     < xdate.mday(date.mdy(8,2,1819) + time.hms(1,26,0)) => 2.00
     < xdate.mday(date.mdy(3,27,1839) + time.hms(20,58,11)) => 27.00
     < xdate.mday(date.mdy(4,19,1903) + time.hms(7,36,5)) => 19.00
     < xdate.mday(date.mdy(8,25,1929) + time.hms(15,43,49)) => 25.00
     < xdate.mday(date.mdy(9,29,1941) + time.hms(4,25,9)) => 29.00
     < xdate.mday(date.mdy(4,19,1943) + time.hms(6,49,27)) => 19.00
     < xdate.mday(date.mdy(10,7,1943) + time.hms(2,57,52)) => 7.00
     < xdate.mday(date.mdy(3,17,1992) + time.hms(16,45,44)) => 17.00
     < xdate.mday(date.mdy(2,25,1996) + time.hms(21,30,57)) => 25.00
     < xdate.mday(date.mdy(9,29,41) + time.hms(4,25,9)) => 29.00
     < xdate.mday(date.mdy(4,19,43) + time.hms(6,49,27)) => 19.00
     < xdate.mday(date.mdy(10,7,43) + time.hms(2,57,52)) => 7.00
     < xdate.mday(date.mdy(3,17,92) + time.hms(16,45,44)) => 17.00
     < xdate.mday(date.mdy(2,25,96) + time.hms(21,30,57)) => 25.00
     < xdate.mday(date.mdy(11,10,2038) + time.hms(22,30,4)) => 10.00
     < xdate.mday(date.mdy(7,18,2094) + time.hms(1,56,51)) => 18.00
     < xdate.minute(date.mdy(6,10,1648) + time.hms(0,0,0)) => 0.00
     < xdate.minute(date.mdy(6,30,1680) + time.hms(4,50,38)) => 50.00
     < xdate.minute(date.mdy(7,24,1716) + time.hms(12,31,35)) => 31.00
     < xdate.minute(date.mdy(6,19,1768) + time.hms(12,47,53)) => 47.00
     < xdate.minute(date.mdy(8,2,1819) + time.hms(1,26,0)) => 26.00
     < xdate.minute(date.mdy(3,27,1839) + time.hms(20,58,11)) => 58.00
     < xdate.minute(date.mdy(4,19,1903) + time.hms(7,36,5)) => 36.00
     < xdate.minute(date.mdy(8,25,1929) + time.hms(15,43,49)) => 43.00
     < xdate.minute(date.mdy(9,29,1941) + time.hms(4,25,9)) => 25.00
     < xdate.minute(date.mdy(4,19,1943) + time.hms(6,49,27)) => 49.00
     < xdate.minute(date.mdy(10,7,1943) + time.hms(2,57,52)) => 57.00
     < xdate.minute(date.mdy(3,17,1992) + time.hms(16,45,44)) => 45.00
     < xdate.minute(date.mdy(2,25,1996) + time.hms(21,30,57)) => 30.00
     < xdate.minute(date.mdy(9,29,41) + time.hms(4,25,9)) => 25.00
     < xdate.minute(date.mdy(4,19,43) + time.hms(6,49,27)) => 49.00
     < xdate.minute(date.mdy(10,7,43) + time.hms(2,57,52)) => 57.00
     < xdate.minute(date.mdy(3,17,92) + time.hms(16,45,44)) => 45.00
     < xdate.minute(date.mdy(2,25,96) + time.hms(21,30,57)) => 30.00
     < xdate.minute(date.mdy(11,10,2038) + time.hms(22,30,4)) => 30.00
     < xdate.minute(date.mdy(7,18,2094) + time.hms(1,56,51)) => 56.00
     < xdate.month(date.mdy(6,10,1648) + time.hms(0,0,0)) => 6.00
     < xdate.month(date.mdy(6,30,1680) + time.hms(4,50,38)) => 6.00
     < xdate.month(date.mdy(7,24,1716) + time.hms(12,31,35)) => 7.00
     < xdate.month(date.mdy(6,19,1768) + time.hms(12,47,53)) => 6.00
     < xdate.month(date.mdy(8,2,1819) + time.hms(1,26,0)) => 8.00
     < xdate.month(date.mdy(3,27,1839) + time.hms(20,58,11)) => 3.00
     < xdate.month(date.mdy(4,19,1903) + time.hms(7,36,5)) => 4.00
     < xdate.month(date.mdy(8,25,1929) + time.hms(15,43,49)) => 8.00
     < xdate.month(date.mdy(9,29,1941) + time.hms(4,25,9)) => 9.00
     < xdate.month(date.mdy(4,19,1943) + time.hms(6,49,27)) => 4.00
     < xdate.month(date.mdy(10,7,1943) + time.hms(2,57,52)) => 10.00
     < xdate.month(date.mdy(3,17,1992) + time.hms(16,45,44)) => 3.00
     < xdate.month(date.mdy(2,25,1996) + time.hms(21,30,57)) => 2.00
     < xdate.month(date.mdy(9,29,41) + time.hms(4,25,9)) => 9.00
     < xdate.month(date.mdy(4,19,43) + time.hms(6,49,27)) => 4.00
     < xdate.month(date.mdy(10,7,43) + time.hms(2,57,52)) => 10.00
     < xdate.month(date.mdy(3,17,92) + time.hms(16,45,44)) => 3.00
     < xdate.month(date.mdy(2,25,96) + time.hms(21,30,57)) => 2.00
     < xdate.month(date.mdy(11,10,2038) + time.hms(22,30,4)) => 11.00
     < xdate.month(date.mdy(7,18,2094) + time.hms(1,56,51)) => 7.00
     < xdate.quarter(date.mdy(6,10,1648) + time.hms(0,0,0)) => 2.00
     < xdate.quarter(date.mdy(6,30,1680) + time.hms(4,50,38)) => 2.00
     < xdate.quarter(date.mdy(7,24,1716) + time.hms(12,31,35)) => 3.00
     < xdate.quarter(date.mdy(6,19,1768) + time.hms(12,47,53)) => 2.00
     < xdate.quarter(date.mdy(8,2,1819) + time.hms(1,26,0)) => 3.00
     < xdate.quarter(date.mdy(3,27,1839) + time.hms(20,58,11)) => 1.00
     < xdate.quarter(date.mdy(4,19,1903) + time.hms(7,36,5)) => 2.00
     < xdate.quarter(date.mdy(8,25,1929) + time.hms(15,43,49)) => 3.00
     < xdate.quarter(date.mdy(9,29,1941) + time.hms(4,25,9)) => 3.00
     < xdate.quarter(date.mdy(4,19,1943) + time.hms(6,49,27)) => 2.00
     < xdate.quarter(date.mdy(10,7,1943) + time.hms(2,57,52)) => 4.00
     < xdate.quarter(date.mdy(3,17,1992) + time.hms(16,45,44)) => 1.00
     < xdate.quarter(date.mdy(2,25,1996) + time.hms(21,30,57)) => 1.00
     < xdate.quarter(date.mdy(9,29,41) + time.hms(4,25,9)) => 3.00
     < xdate.quarter(date.mdy(4,19,43) + time.hms(6,49,27)) => 2.00
     < xdate.quarter(date.mdy(10,7,43) + time.hms(2,57,52)) => 4.00
     < xdate.quarter(date.mdy(3,17,92) + time.hms(16,45,44)) => 1.00
     < xdate.quarter(date.mdy(2,25,96) + time.hms(21,30,57)) => 1.00
     < xdate.quarter(date.mdy(11,10,2038) + time.hms(22,30,4)) => 4.00
     < xdate.quarter(date.mdy(7,18,2094) + time.hms(1,56,51)) => 3.00
     < xdate.second(date.mdy(6,10,1648) + time.hms(0,0,0)) => 0.00
     < xdate.second(date.mdy(6,30,1680) + time.hms(4,50,38)) => 38.00
     < xdate.second(date.mdy(7,24,1716) + time.hms(12,31,35)) => 35.00
     < xdate.second(date.mdy(6,19,1768) + time.hms(12,47,53)) => 53.00
     < xdate.second(date.mdy(8,2,1819) + time.hms(1,26,0)) => 0.00
     < xdate.second(date.mdy(3,27,1839) + time.hms(20,58,11)) => 11.00
     < xdate.second(date.mdy(4,19,1903) + time.hms(7,36,5)) => 5.00
     < xdate.second(date.mdy(8,25,1929) + time.hms(15,43,49)) => 49.00
     < xdate.second(date.mdy(9,29,1941) + time.hms(4,25,9)) => 9.00
     < xdate.second(date.mdy(4,19,1943) + time.hms(6,49,27)) => 27.00
     < xdate.second(date.mdy(10,7,1943) + time.hms(2,57,52)) => 52.00
     < xdate.second(date.mdy(3,17,1992) + time.hms(16,45,44)) => 44.00
     < xdate.second(date.mdy(2,25,1996) + time.hms(21,30,57)) => 57.00
     < xdate.second(date.mdy(9,29,41) + time.hms(4,25,9)) => 9.00
     < xdate.second(date.mdy(4,19,43) + time.hms(6,49,27)) => 27.00
     < xdate.second(date.mdy(10,7,43) + time.hms(2,57,52)) => 52.00
     < xdate.second(date.mdy(3,17,92) + time.hms(16,45,44)) => 44.00
     < xdate.second(date.mdy(2,25,96) + time.hms(21,30,57)) => 57.00
     < xdate.second(date.mdy(11,10,2038) + time.hms(22,30,4)) => 4.00
     < xdate.second(date.mdy(7,18,2094) + time.hms(1,56,51)) => 51.00
     < xdate.tday(date.mdy(6,10,1648) + time.hms(0,0,0)) => 23981.00
     < xdate.tday(date.mdy(6,30,1680) + time.hms(4,50,38)) => 35689.00
     < xdate.tday(date.mdy(7,24,1716) + time.hms(12,31,35)) => 48861.00
     < xdate.tday(date.mdy(6,19,1768) + time.hms(12,47,53)) => 67819.00
     < xdate.tday(date.mdy(8,2,1819) + time.hms(1,26,0)) => 86489.00
     < xdate.tday(date.mdy(3,27,1839) + time.hms(20,58,11)) => 93666.00
     < xdate.tday(date.mdy(4,19,1903) + time.hms(7,36,5)) => 117064.00
     < xdate.tday(date.mdy(8,25,1929) + time.hms(15,43,49)) => 126689.00
     < xdate.tday(date.mdy(9,29,1941) + time.hms(4,25,9)) => 131107.00
     < xdate.tday(date.mdy(4,19,1943) + time.hms(6,49,27)) => 131674.00
     < xdate.tday(date.mdy(10,7,1943) + time.hms(2,57,52)) => 131845.00
     < xdate.tday(date.mdy(3,17,1992) + time.hms(16,45,44)) => 149539.00
     < xdate.tday(date.mdy(2,25,1996) + time.hms(21,30,57)) => 150979.00
     < xdate.tday(date.mdy(9,29,41) + time.hms(4,25,9)) => 131107.00
     < xdate.tday(date.mdy(4,19,43) + time.hms(6,49,27)) => 131674.00
     < xdate.tday(date.mdy(10,7,43) + time.hms(2,57,52)) => 131845.00
     < xdate.tday(date.mdy(3,17,92) + time.hms(16,45,44)) => 149539.00
     < xdate.tday(date.mdy(2,25,96) + time.hms(21,30,57)) => 150979.00
     < xdate.tday(date.mdy(11,10,2038) + time.hms(22,30,4)) => 166578.00
     < xdate.tday(date.mdy(7,18,2094) + time.hms(1,56,51)) => 186917.00
     < xdate.time(date.mdy(6,10,1648) + time.hms(0,0,0)) => 0.00
     < xdate.time(date.mdy(6,30,1680) + time.hms(4,50,38)) => 17438.00
     < xdate.time(date.mdy(7,24,1716) + time.hms(12,31,35)) => 45095.00
     < xdate.time(date.mdy(6,19,1768) + time.hms(12,47,53)) => 46073.00
     < xdate.time(date.mdy(8,2,1819) + time.hms(1,26,0)) => 5160.00
     < xdate.time(date.mdy(3,27,1839) + time.hms(20,58,11)) => 75491.00
     < xdate.time(date.mdy(4,19,1903) + time.hms(7,36,5)) => 27365.00
     < xdate.time(date.mdy(8,25,1929) + time.hms(15,43,49)) => 56629.00
     < xdate.time(date.mdy(9,29,1941) + time.hms(4,25,9)) => 15909.00
     < xdate.time(date.mdy(4,19,1943) + time.hms(6,49,27)) => 24567.00
     < xdate.time(date.mdy(10,7,1943) + time.hms(2,57,52)) => 10672.00
     < xdate.time(date.mdy(3,17,1992) + time.hms(16,45,44)) => 60344.00
     < xdate.time(date.mdy(2,25,1996) + time.hms(21,30,57)) => 77457.00
     < xdate.time(date.mdy(9,29,41) + time.hms(4,25,9)) => 15909.00
     < xdate.time(date.mdy(4,19,43) + time.hms(6,49,27)) => 24567.00
     < xdate.time(date.mdy(10,7,43) + time.hms(2,57,52)) => 10672.00
     < xdate.time(date.mdy(3,17,92) + time.hms(16,45,44)) => 60344.00
     < xdate.time(date.mdy(2,25,96) + time.hms(21,30,57)) => 77457.00
     < xdate.time(date.mdy(11,10,2038) + time.hms(22,30,4)) => 81004.00
     < xdate.time(date.mdy(7,18,2094) + time.hms(1,56,51)) => 7011.00
     < xdate.week(date.mdy(6,10,1648) + time.hms(0,0,0)) => 24.00
     < xdate.week(date.mdy(6,30,1680) + time.hms(4,50,38)) => 26.00
     < xdate.week(date.mdy(7,24,1716) + time.hms(12,31,35)) => 30.00
     < xdate.week(date.mdy(6,19,1768) + time.hms(12,47,53)) => 25.00
     < xdate.week(date.mdy(8,2,1819) + time.hms(1,26,0)) => 31.00
     < xdate.week(date.mdy(3,27,1839) + time.hms(20,58,11)) => 13.00
     < xdate.week(date.mdy(4,19,1903) + time.hms(7,36,5)) => 16.00
     < xdate.week(date.mdy(8,25,1929) + time.hms(15,43,49)) => 34.00
     < xdate.week(date.mdy(9,29,1941) + time.hms(4,25,9)) => 39.00
     < xdate.week(date.mdy(4,19,1943) + time.hms(6,49,27)) => 16.00
     < xdate.week(date.mdy(10,7,1943) + time.hms(2,57,52)) => 40.00
     < xdate.week(date.mdy(3,17,1992) + time.hms(16,45,44)) => 11.00
     < xdate.week(date.mdy(2,25,1996) + time.hms(21,30,57)) => 8.00
     < xdate.week(date.mdy(9,29,41) + time.hms(4,25,9)) => 39.00
     < xdate.week(date.mdy(4,19,43) + time.hms(6,49,27)) => 16.00
     < xdate.week(date.mdy(10,7,43) + time.hms(2,57,52)) => 40.00
     < xdate.week(date.mdy(3,17,92) + time.hms(16,45,44)) => 11.00
     < xdate.week(date.mdy(2,25,96) + time.hms(21,30,57)) => 8.00
     < xdate.week(date.mdy(11,10,2038) + time.hms(22,30,4)) => 45.00
     < xdate.week(date.mdy(7,18,2094) + time.hms(1,56,51)) => 29.00
     < xdate.wkday(date.mdy(6,10,1648)) => 4.00
     < xdate.wkday(date.mdy(6,30,1680)) => 1.00
     < xdate.wkday(date.mdy(7,24,1716)) => 6.00
     < xdate.wkday(date.mdy(6,19,1768)) => 1.00
     < xdate.wkday(date.mdy(8,2,1819)) => 2.00
     < xdate.wkday(date.mdy(3,27,1839)) => 4.00
     < xdate.wkday(date.mdy(4,19,1903)) => 1.00
     < xdate.wkday(date.mdy(8,25,1929)) => 1.00
     < xdate.wkday(date.mdy(9,29,1941)) => 2.00
     < xdate.wkday(date.mdy(4,19,1943)) => 2.00
     < xdate.wkday(date.mdy(10,7,1943)) => 5.00
     < xdate.wkday(date.mdy(3,17,1992)) => 3.00
     < xdate.wkday(date.mdy(2,25,1996)) => 1.00
     < xdate.wkday(date.mdy(9,29,41)) => 2.00
     < xdate.wkday(date.mdy(4,19,43)) => 2.00
     < xdate.wkday(date.mdy(10,7,43)) => 5.00
     < xdate.wkday(date.mdy(3,17,92)) => 3.00
     < xdate.wkday(date.mdy(2,25,96)) => 1.00
     < xdate.wkday(date.mdy(11,10,2038)) => 4.00
     < xdate.wkday(date.mdy(7,18,2094)) => 1.00
     < xdate.year(date.mdy(6,10,1648) + time.hms(0,0,0)) => 1648.00
     < xdate.year(date.mdy(6,30,1680) + time.hms(4,50,38)) => 1680.00
     < xdate.year(date.mdy(7,24,1716) + time.hms(12,31,35)) => 1716.00
     < xdate.year(date.mdy(6,19,1768) + time.hms(12,47,53)) => 1768.00
     < xdate.year(date.mdy(8,2,1819) + time.hms(1,26,0)) => 1819.00
     < xdate.year(date.mdy(3,27,1839) + time.hms(20,58,11)) => 1839.00
     < xdate.year(date.mdy(4,19,1903) + time.hms(7,36,5)) => 1903.00
     < xdate.year(date.mdy(8,25,1929) + time.hms(15,43,49)) => 1929.00
     < xdate.year(date.mdy(9,29,1941) + time.hms(4,25,9)) => 1941.00
     < xdate.year(date.mdy(4,19,1943) + time.hms(6,49,27)) => 1943.00
     < xdate.year(date.mdy(10,7,1943) + time.hms(2,57,52)) => 1943.00
     < xdate.year(date.mdy(3,17,1992) + time.hms(16,45,44)) => 1992.00
     < xdate.year(date.mdy(2,25,1996) + time.hms(21,30,57)) => 1996.00
     < xdate.year(date.mdy(9,29,41) + time.hms(4,25,9)) => 1941.00
     < xdate.year(date.mdy(4,19,43) + time.hms(6,49,27)) => 1943.00
     < xdate.year(date.mdy(10,7,43) + time.hms(2,57,52)) => 1943.00
     < xdate.year(date.mdy(3,17,92) + time.hms(16,45,44)) => 1992.00
     < xdate.year(date.mdy(2,25,96) + time.hms(21,30,57)) => 1996.00
     < xdate.year(date.mdy(11,10,2038) + time.hms(22,30,4)) => 2038.00
     < xdate.year(date.mdy(7,18,2094) + time.hms(1,56,51)) => 2094.00
     < 1000 * ncdf.beta(.868,10,20,150) => 937.66
     < 1000 * ncdf.beta(.9,10,10,120) => 730.68
     < 1000 * ncdf.beta(.88,15,5,80) => 160.43
     < 1000 * ncdf.beta(.85,20,10,110) => 186.75
     < 1000 * ncdf.beta(.66,20,30,65) => 655.94
     < 1000 * ncdf.beta(.72,20,50,130) => 979.69
     < 1000 * ncdf.beta(.72,30,20,80) => 116.24
     < 1000 * ncdf.beta(.8,30,40,130) => 993.04
     < (X = 1.00); X => 1.00
     < SYSMIS(1) => false
     < SYSMIS($SYSMIS) => true
     < SYSMIS(1 + $SYSMIS) => true
     < (X = 10.00); x + 0 => 10.00
     < (X = -3.00); x - 0 => -3.00
     < (X = 5.00); 0 + x => 5.00
     < (X = 10.00); x * 1 => 10.00
     < (X = -3.00); 1 * x => -3.00
     < (X = 5.00); x / 1 => 5.00
     < (X = 10.00); 0 * x => 0.00
     < (X = -3.00); x * 0 => 0.00
     < (X = 5.00); 0 / x => 0.00
     < (X = 5.00); mod(0, x) => 0.00
     < (X = 5.00); x ** 1 => 5.00
     < (X = 5.00); x ** 2 => 25.00
     ---
     > 'string' AND $sysmis =>
******************************************************************
     > You have discovered a bug in PSPP.
     >
     >   Please report this, by sending an email to address@hidden,
     > explaining what you were doing when this happened, and including
     > a sample of your input file which caused it.
     > Also, please copy the following lines into your bug report:
     >
     > bare_version:        0.4.0.1
     > version:             GNU pspp 0.4.0.1
     > stat_version:        GNU pspp 0.4.0.1 (Do 27. M??r 18:01:30 CET 2008).
     > host_system:         x86_64-unknown-linux-gnu
     > build_system:        x86_64-unknown-linux-gnu
     > default_config_path: ~/.pspp:/usr/local/etc/pspp
     > include_path:        ./:~/.pspp/include:/usr/local/share/pspp
     > groff_font_path:
~/.pspp/font:/usr/local/share/pspp/font:/usr/local/lib/groff/font:/usr/lib/gr
off/font:/usr/local/share/groff/font:/usr/share/groff/font
     > locale_dir:          /usr/local/share/locale
     > compiler version:    4.2.1 (SUSE Linux)
     > Diagnosis: Segmentation Violation
     > ******************************************************************
     compare optimizing output
     FAILED
     FAIL: expressions/expressions.sh
     *** glibc detected ***
/home/andreas/Software/PSPP/pspp-0.4.0.1/tests/../src/pspp: double free or
corruption (!prev): 0x00000000006d2f40 ***
     ======= Backtrace: =========
     /lib64/libc.so.6[0x2b7cce45b21d]
     /lib64/libc.so.6(cfree+0x76)[0x2b7cce45cf76]
     /home/andreas/Software/PSPP/pspp-0.4.0.1/tests/../src/pspp[0x46b9ad]
     /home/andreas/Software/PSPP/pspp-0.4.0.1/tests/../src/pspp[0x441aba]
     /home/andreas/Software/PSPP/pspp-0.4.0.1/tests/../src/pspp[0x484b4f]
     /home/andreas/Software/PSPP/pspp-0.4.0.1/tests/../src/pspp[0x42f7bf]
     /home/andreas/Software/PSPP/pspp-0.4.0.1/tests/../src/pspp[0x48ea51]
     /home/andreas/Software/PSPP/pspp-0.4.0.1/tests/../src/pspp[0x485fee]
     /home/andreas/Software/PSPP/pspp-0.4.0.1/tests/../src/pspp[0x483859]
     /home/andreas/Software/PSPP/pspp-0.4.0.1/tests/../src/pspp[0x432423]
     /home/andreas/Software/PSPP/pspp-0.4.0.1/tests/../src/pspp[0x450b61]
     /lib64/libc.so.6(__libc_start_main+0xf4)[0x2b7cce40ab54]
     /home/andreas/Software/PSPP/pspp-0.4.0.1/tests/../src/pspp[0x405719]
     ======= Memory map: ========
     00400000-004c8000 r-xp 00000000 08:07 1028811
/home/andreas/Software/PSPP/pspp-0.4.0.1/src/pspp
     006c7000-006c8000 r--p 000c7000 08:07 1028811
/home/andreas/Software/PSPP/pspp-0.4.0.1/src/pspp
     006c8000-006ce000 rw-p 000c8000 08:07 1028811
/home/andreas/Software/PSPP/pspp-0.4.0.1/src/pspp
     006ce000-006f1000 rw-p 006ce000 00:00 0
[heap]
     2b7ccd836000-2b7ccd852000 r-xp 00000000 08:06 196045
/lib64/ld-2.6.1.so
     2b7ccd852000-2b7ccd853000 rw-p 2b7ccd852000 00:00 0
     2b7ccd853000-2b7ccd854000 r--p 00000000 08:06 752178
/usr/lib/locale/de_DE.utf8/LC_MESSAGES/SYS_LC_MESSAGES
     2b7ccd854000-2b7ccd85b000 r--s 00000000 08:06 757737
/usr/lib64/gconv/gconv-modules.cache
     2b7ccd85b000-2b7ccd85c000 r--p 00000000 08:06 752169
/usr/lib/locale/de_DE.utf8/LC_MONETARY
     2b7ccd85c000-2b7ccd85e000 rw-p 2b7ccd85c000 00:00 0
     2b7ccd871000-2b7ccd872000 rw-p 2b7ccd871000 00:00 0
     2b7ccda51000-2b7ccda53000 rw-p 0001b000 08:06 196045
/lib64/ld-2.6.1.so
     2b7ccda53000-2b7ccdd14000 r-xp 00000000 08:06 637552
/usr/lib64/libgsl.so.0.10.0
     2b7ccdd14000-2b7ccdf13000 ---p 002c1000 08:06 637552
/usr/lib64/libgsl.so.0.10.0
     2b7ccdf13000-2b7ccdf15000 r--p 002c0000 08:06 637552
/usr/lib64/libgsl.so.0.10.0
     2b7ccdf15000-2b7ccdf21000 rw-p 002c2000 08:06 637552
/usr/lib64/libgsl.so.0.10.0
     2b7ccdf21000-2b7ccdf98000 r-xp 00000000 08:06 637564
/usr/lib64/libgslcblas.so.0.0.0
     2b7ccdf98000-2b7cce197000 ---p 00077000 08:06 637564
/usr/lib64/libgslcblas.so.0.0.0
     2b7cce197000-2b7cce199000 rw-p 00076000 08:06 637564
/usr/lib64/libgslcblas.so.0.0.0
     2b7cce199000-2b7cce1eb000 r-xp 00000000 08:06 195856
/lib64/libm-2.6.1.so
     2b7cce1eb000-2b7cce3ea000 ---p 00052000 08:06 195856
/lib64/libm-2.6.1.so
     2b7cce3ea000-2b7cce3ec000 rw-p 00051000 08:06 195856
/lib64/libm-2.6.1.so
     2b7cce3ec000-2b7cce3ed000 rw-p 2b7cce3ec000 00:00 0
     2b7cce3ed000-2b7cce529000 r-xp 00000000 08:06 195848
/lib64/libc-2.6.1.so
     2b7cce529000-2b7cce728000 ---p 0013c000 08:06 195848
/lib64/libc-2.6.1.so
     2b7cce728000-2b7cce72b000 r--p 0013b000 08:06 195848
/lib64/libc-2.6.1.so
     2b7cce72b000-2b7cce72d000 rw-p 0013e000 08:06 195848
/lib64/libc-2.6.1.so
     2b7cce72d000-2b7cce733000 rw-p 2b7cce72d000 00:00 0
     2b7cce733000-2b7cce740000 r-xp 00000000 08:06 195927
/lib64/libgcc_s.so.1
     2b7cce740000-2b7cce93f000 ---p 0000d000 08:06 195927
/lib64/libgcc_s.so.1
     2b7cce93f000-2b7cce941000 rw-p 0000c000 08:06 195927
/lib64/libgcc_s.so.1
     2b7cd0000000-2b7cd0021000 rw-p 2b7cd0000000 00:00 0
     2b7cd0021000-2b7cd4000000 ---p 2b7cd0021000 00:00 0
     7fffdd25f./expressions/epoch.sh: line 138:  3896 Abgebrochen
$SUPERVISOR $here/../src/pspp --testing-mode $TEMPDIR/epoch.stat >
$TEMPDIR/epoch.err 2> $TEMPDIR/epoch.out
     7c7,74
     < YRMODA(100,1,1) =>
     \ Kein Zeilenumbruch am Dateiende.
     ---
     > YRMODA(100,1,1) => sysmis
     > DATE.DMY(1,1,0) = DATE.DMY(1,1,1900) => true
     > DATE.DMY(1,1,1) = DATE.DMY(1,1,1901) => true
     > DATE.DMY(1,1,12) = DATE.DMY(1,1,1912) => true
     > DATE.DMY(1,1,70) = DATE.DMY(1,1,1970) => true
     > DATE.DMY(1,1,87) = DATE.DMY(1,1,1987) => true
     > DATE.DMY(1,1,99) = DATE.DMY(1,1,1999) => true
     > DATE.DMY(1,1,100) => sysmis
     >
     > YRMODA(0,1,1) = YRMODA(1900,1,1) => true
     > YRMODA(1,1,1) = YRMODA(1901,1,1) => true
     > YRMODA(12,1,1) = YRMODA(1912,1,1) => true
     > YRMODA(70,1,1) = YRMODA(1970,1,1) => true
     > YRMODA(87,1,1) = YRMODA(1987,1,1) => true
     > YRMODA(99,1,1) = YRMODA(1999,1,1) => true
     > YRMODA(100,1,1) => sysmis
     > DATE.DMY(1,1,0) = DATE.DMY(1,1,2000) => true
     > DATE.DMY(1,1,1) = DATE.DMY(1,1,1901) => true
     > DATE.DMY(1,1,12) = DATE.DMY(1,1,1912) => true
     > DATE.DMY(1,1,70) = DATE.DMY(1,1,1970) => true
     > DATE.DMY(1,1,87) = DATE.DMY(1,1,1987) => true
     > DATE.DMY(1,1,99) = DATE.DMY(1,1,1999) => true
     > DATE.DMY(1,1,100) => sysmis
     >
     > YRMODA(0,1,1) = YRMODA(1900,1,1) => true
     > YRMODA(1,1,1) = YRMODA(1901,1,1) => true
     > YRMODA(12,1,1) = YRMODA(1912,1,1) => true
     > YRMODA(70,1,1) = YRMODA(1970,1,1) => true
     > YRMODA(87,1,1) = YRMODA(1987,1,1) => true
     > YRMODA(99,1,1) = YRMODA(1999,1,1) => true
     > YRMODA(100,1,1) => sysmis
     > DATE.DMY(1,1,0) = DATE.DMY(1,1,2000) => true
     > DATE.DMY(1,1,1) = DATE.DMY(1,1,2001) => true
     > DATE.DMY(1,1,12) = DATE.DMY(1,1,1912) => true
     > DATE.DMY(1,1,70) = DATE.DMY(1,1,1970) => true
     > DATE.DMY(1,1,87) = DATE.DMY(1,1,1987) => true
     > DATE.DMY(1,1,99) = DATE.DMY(1,1,1999) => true
     > DATE.DMY(1,1,100) => sysmis
     >
     > YRMODA(0,1,1) = YRMODA(1900,1,1) => true
     > YRMODA(1,1,1) = YRMODA(1901,1,1) => true
     > YRMODA(12,1,1) = YRMODA(1912,1,1) => true
     > YRMODA(70,1,1) = YRMODA(1970,1,1) => true
     > YRMODA(87,1,1) = YRMODA(1987,1,1) => true
     > YRMODA(99,1,1) = YRMODA(1999,1,1) => true
     > YRMODA(100,1,1) => sysmis
     > DATE.DMY(1,1,0) = DATE.DMY(1,1,2000) => true
     > DATE.DMY(1,1,1) = DATE.DMY(1,1,2001) => true
     > DATE.DMY(1,1,12) = DATE.DMY(1,1,1912) => true
     > DATE.DMY(1,1,70) = DATE.DMY(1,1,1970) => true
     > DATE.DMY(1,1,87) = DATE.DMY(1,1,1987) => true
     > DATE.DMY(1,1,99) = DATE.DMY(1,1,1999) => true
     > DATE.DMY(1,1,100) => sysmis
     >
     > YRMODA(0,1,1) = YRMODA(1900,1,1) => true
     > YRMODA(1,1,1) = YRMODA(1901,1,1) => true
     > YRMODA(12,1,1) = YRMODA(1912,1,1) => true
     > YRMODA(70,1,1) = YRMODA(1970,1,1) => true
     > YRMODA(87,1,1) = YRMODA(1987,1,1) => true
     > YRMODA(99,1,1) = YRMODA(1999,1,1) => true
     > YRMODA(100,1,1) => sysmis
     > DATE.DMY(1,1,0) = DATE.DMY(1,1,2100) => true
     > DATE.DMY(1,1,1) = DATE.DMY(1,1,2101) => true
     > DATE.DMY(1,1,12) = DATE.DMY(1,1,2012) => true
     > DATE.DMY(1,1,70) = DATE.DMY(1,1,2070) => true
     > DATE.DMY(1,1,87) = DATE.DMY(1,1,2087) => true
     > DATE.DMY(1,1,99) = DATE.DMY(1,1,2099) => true
     > DATE.DMY(1,1,100) => sysmis
     compare results
     NO RESULT
     FAIL: expressions/epoch.sh
     42c42
     <      .99     2.00     9.21      .99      .00      .01
     ---
     >      .99     2.00     9.21      .99      .01      .01
     compare output for chisq distribution
     FAILED
     FAIL: expressions/randist.sh
     ./expressions/variables.sh: line 96:  3923 Abgebrochen
$SUPERVISOR $here/../src/pspp -o raw-ascii $TEMPDIR/variables.stat >
$TEMPDIR/variables.err 2> $TEMPDIR/variables.out
     run program
     FAILED
     FAIL: expressions/variables.sh
     ./expressions/vectors.sh: line 72:  3934 Abgebrochen
$SUPERVISOR $here/../src/pspp -o raw-ascii $TEMPDIR/vectors.stat >
$TEMPDIR/vectors.err 2> $TEMPDIR/vectors.out
     run program
     FAILED
     FAIL: expressions/vectors.sh
     =====================================
     43 of 93 tests failed
     Please report to address@hidden
     =====================================
     make[2]: *** [check-TESTS] Fehler 1
     make[2]: Leaving directory
`/home/andreas/Software/PSPP/pspp-0.4.0.1/tests'
     make[1]: *** [check-am] Fehler 2
     make[1]: Leaving directory
`/home/andreas/Software/PSPP/pspp-0.4.0.1/tests'
     make: *** [check-recursive] Fehler 1
     address@hidden:~/Software/PSPP/pspp-0.4.0.1>

     _______________________________________________
     Bug-gnu-pspp mailing list
     address@hidden
     http://lists.gnu.org/mailman/listinfo/bug-gnu-pspp


-- 
PGP Public key ID: 1024D/2DE827B3 
fingerprint = 8797 A26D 0854 2EAB 0285  A290 8A67 719C 2DE8 27B3
See http://pgp.mit.edu or any PGP keyserver for public key.







reply via email to

[Prev in Thread] Current Thread [Next in Thread]