bug-gnu-emacs
[Top][All Lists]
Advanced

[Date Prev][Date Next][Thread Prev][Thread Next][Date Index][Thread Index]

bug#35410: 27.0.50; 32-bit build of master failing with MSYS2


From: Noam Postavsky
Subject: bug#35410: 27.0.50; 32-bit build of master failing with MSYS2
Date: Thu, 11 Jul 2019 14:23:42 -0400
User-agent: Gnus/5.13 (Gnus v5.13) Emacs/26.1.92 (windows-nt)

martin rudalics <address@hidden> writes:

> Trying a 32-bit MSYS2 build of master on Windows 10 configured with
> CFLAGS='-O3' gets me here:
>
> w32.o:w32.c:(.text+0xa29f): undefined reference to `_imp___futime32'
> collect2.exe: error: ld returned 1 exit status
> make[1]: *** [Makefile:643: temacs.exe] Fehler 1
> make[1]: Verzeichnis „/c/emacs/trunk/opt-32/src“ wird verlassen
> make: *** [Makefile:423: src] Fehler 2
>
> A build configured with CFLAGS='-O0 -g3' proceeds without problems.
> The 32-builds use gcc 7.4.0.  64-bit builds with the same options
> proceed without problems using gcc 8.3.0.

Seems to work okay here, but my ming32 gcc is 7.2.0.  Is this still a
problem?






reply via email to

[Prev in Thread] Current Thread [Next in Thread]