bug-gnu-emacs
[Top][All Lists]
Advanced

[Date Prev][Date Next][Thread Prev][Thread Next][Date Index][Thread Index]

bug#7870: 24.0.50; Build failure of trunk on gtk3


From: Jan Djärv
Subject: bug#7870: 24.0.50; Build failure of trunk on gtk3
Date: Tue, 08 Mar 2011 09:40:48 +0100
User-agent: Mozilla/5.0 (Macintosh; U; Intel Mac OS X 10.6; sv-SE; rv:1.9.2.14) Gecko/20110207 Thunderbird/3.1.8

A few days was optimistic, but it now compiles for Gtk+ 3.

        Jan D.


Jan Djärv skrev 2011-01-20 06.48:
Gtk3 is still evolving, and Emacs doesn't try to keep in sync all the time.
I'm about to check in a new update for Gtk3 in a few days or so.  There has 
been massive Gtk3-changes lately.

     Jan D.


20 jan 2011 kl. 02:17 skrev sangu sangu<address@hidden>:

Building with gtk3 option in recent emacs git trunk, bootstrap was failure.

$ ./configure --with-x-toolkit=gtk3
$ make bootstrap
[...]
1.0/include   -DORBIT2=1 -pthread -I/usr/include/gconf/2 
-I/usr/include/orbit-2.0 -I/usr/include/glib-2.0 -I/usr/lib64/glib-2.0/include  
   -I/usr/include/freetype2    -MMD -MF deps/xterm.d   
-Wimplicit-function-declaration -Wold-style-definition 
-Wdeclaration-after-statement -Wno-pointer-sign  -g -O2 xterm.c
xterm.c: In function 'x_set_frame_alpha':
xterm.c:449:3: warning: implicit declaration of function 'GDK_WINDOW_XWINDOW'
xterm.c: In function 'XTflash':
xterm.c:3027:5: error: 'GdkGCValues' undeclared (first use in this function)
xterm.c:3027:5: note: each undeclared identifier is reported only once for each 
function it appears in
xterm.c:3027:17: error: expected ';' before 'vals'
xterm.c:3028:5: error: 'GdkGC' undeclared (first use in this function)
xterm.c:3028:12: error: 'gc' undeclared (first use in this function)
xterm.c:3029:5: error: 'vals' undeclared (first use in this function)
xterm.c:3031:21: error: 'GDK_XOR' undeclared (first use in this function)
xterm.c:3032:5: warning: implicit declaration of function 
'gdk_gc_new_with_values'
xterm.c:3033:41: error: 'GDK_GC_FUNCTION' undeclared (first use in this 
function)
xterm.c:3033:59: error: 'GDK_GC_FOREGROUND' undeclared (first use in this 
function)
xterm.c:3084:4: warning: implicit declaration of function 'gdk_draw_rectangle'
xterm.c: In function 'x_term_init':
xterm.c:9926:15: error: expected expression before ')' token
make[2]: *** [xterm.o] Error 1
make[2]: Leaving directory `/home/sangu/git/emacs/src'
make[1]: *** [src] Error 2
make[1]: Leaving directory `/home/sangu/git/emacs'
make: *** [bootstrap] Error 2


gtk3-2.99.2-1.fc15.x86_64
glib2-2.27.91-1.fc15.x86_64






reply via email to

[Prev in Thread] Current Thread [Next in Thread]